SaveText.Ru

Без имени
  1. npm ERR! code 1
  2. npm ERR! path D:OpenServerOSPaneldomainsКурсBudgetbudget-appnode_modulesnode-sass
  3. npm ERR! command failed
  4. npm ERR! command C:WINDOWSsystem32cmd.exe /d /s /c node scripts/build.js
  5. npm ERR! Building: C:Program Filesnodejsnode.exe D:OpenServerOSPaneldomainsКурсBudgetbudget-appnode_modulesnode-gypbinnode-gyp.js rebuild --verbose --libsass_ext= --libsass_cflags= --libsass_ldflags= --libsass_library=
  6. npm ERR! gyp info it worked if it ends with ok
  7. npm ERR! gyp verb cli [
  8. npm ERR! gyp verb cli   'C:\Program Files\nodejs\node.exe',
  9. npm ERR! gyp verb cli   'D:\OpenServer\OSPanel\domains\Курс\Budget\budget-app\node_modules\node-gyp\bin\node-gyp.js',
  10. npm ERR! gyp verb cli   'rebuild',
  11. npm ERR! gyp verb cli   '--verbose',
  12. npm ERR! gyp verb cli   '--libsass_ext=',
  13. npm ERR! gyp verb cli   '--libsass_cflags=',
  14. npm ERR! gyp verb cli   '--libsass_ldflags=',
  15. npm ERR! gyp verb cli   '--libsass_library='
  16. npm ERR! gyp verb cli ]
  17. npm ERR! gyp info using [email protected]
  18. npm ERR! gyp info using [email protected] | win32 | x64
  19. npm ERR! gyp verb command rebuild []
  20. npm ERR! gyp verb command clean []
  21. npm ERR! gyp verb clean removing "build" directory
  22. npm ERR! gyp verb command configure []
  23. npm ERR! gyp verb check python checking for Python executable "python2" in the PATH
  24. npm ERR! gyp verb `which` failed Error: not found: python2
  25. npm ERR! gyp verb `which` failed     at getNotFoundError (D:OpenServerOSPaneldomainsКурсBudgetbudget-appnode_moduleswhichwhich.js:13:12)
  26. npm ERR! gyp verb `which` failed     at F (D:OpenServerOSPaneldomainsКурсBudgetbudget-appnode_moduleswhichwhich.js:68:19)      
  27. npm ERR! gyp verb `which` failed     at E (D:OpenServerOSPaneldomainsКурсBudgetbudget-appnode_moduleswhichwhich.js:80:29)      
  28. npm ERR! gyp verb `which` failed     at D:OpenServerOSPaneldomainsКурсBudgetbudget-appnode_moduleswhichwhich.js:89:16
  29. npm ERR! gyp verb `which` failed     at D:OpenServerOSPaneldomainsКурсBudgetbudget-appnode_modulesisexeindex.js:42:5
  30. npm ERR! gyp verb `which` failed     at D:OpenServerOSPaneldomainsКурсBudgetbudget-appnode_modulesisexewindows.js:36:5
  31. npm ERR! gyp verb `which` failed     at FSReqCallback.oncomplete (node:fs:195:21)
  32. npm ERR! gyp verb `which` failed  python2 Error: not found: python2
  33. npm ERR! gyp verb `which` failed     at getNotFoundError (D:OpenServerOSPaneldomainsКурсBudgetbudget-appnode_moduleswhichwhich.js:13:12)
  34. npm ERR! gyp verb `which` failed     at F (D:OpenServerOSPaneldomainsКурсBudgetbudget-appnode_moduleswhichwhich.js:68:19)      
  35. npm ERR! gyp verb `which` failed     at E (D:OpenServerOSPaneldomainsКурсBudgetbudget-appnode_moduleswhichwhich.js:80:29)      
  36. npm ERR! gyp verb `which` failed     at D:OpenServerOSPaneldomainsКурсBudgetbudget-appnode_moduleswhichwhich.js:89:16
  37. npm ERR! gyp verb `which` failed     at D:OpenServerOSPaneldomainsКурсBudgetbudget-appnode_modulesisexeindex.js:42:5
  38. npm ERR! gyp verb `which` failed     at D:OpenServerOSPaneldomainsКурсBudgetbudget-appnode_modulesisexewindows.js:36:5
  39. npm ERR! gyp verb `which` failed     at FSReqCallback.oncomplete (node:fs:195:21) {
  40. npm ERR! gyp verb `which` failed   code: 'ENOENT'
  41. npm ERR! gyp verb `which` failed }
  42. npm ERR! gyp verb check python checking for Python executable "python" in the PATH
  43. npm ERR! gyp verb `which` failed Error: not found: python
  44. npm ERR! gyp verb `which` failed     at getNotFoundError (D:OpenServerOSPaneldomainsКурсBudgetbudget-appnode_moduleswhichwhich.js:13:12)
  45. npm ERR! gyp verb `which` failed     at F (D:OpenServerOSPaneldomainsКурсBudgetbudget-appnode_moduleswhichwhich.js:68:19)      
  46. npm ERR! gyp verb `which` failed     at E (D:OpenServerOSPaneldomainsКурсBudgetbudget-appnode_moduleswhichwhich.js:80:29)      
  47. npm ERR! gyp verb `which` failed     at D:OpenServerOSPaneldomainsКурсBudgetbudget-appnode_moduleswhichwhich.js:89:16
  48. npm ERR! gyp verb `which` failed     at D:OpenServerOSPaneldomainsКурсBudgetbudget-appnode_modulesisexeindex.js:42:5
  49. npm ERR! gyp verb `which` failed     at D:OpenServerOSPaneldomainsКурсBudgetbudget-appnode_modulesisexewindows.js:36:5
  50. npm ERR! gyp verb `which` failed     at FSReqCallback.oncomplete (node:fs:195:21)
  51. npm ERR! gyp verb `which` failed  python Error: not found: python  
  52. npm ERR! gyp verb `which` failed     at getNotFoundError (D:OpenServerOSPaneldomainsКурсBudgetbudget-appnode_moduleswhichwhich.js:13:12)
  53. npm ERR! gyp verb `which` failed     at F (D:OpenServerOSPaneldomainsКурсBudgetbudget-appnode_moduleswhichwhich.js:68:19)      
  54. npm ERR! gyp verb `which` failed     at E (D:OpenServerOSPaneldomainsКурсBudgetbudget-appnode_moduleswhichwhich.js:80:29)      
  55. npm ERR! gyp verb `which` failed     at D:OpenServerOSPaneldomainsКурсBudgetbudget-appnode_moduleswhichwhich.js:89:16
  56. npm ERR! gyp verb `which` failed     at D:OpenServerOSPaneldomainsКурсBudgetbudget-appnode_modulesisexeindex.js:42:5
  57. npm ERR! gyp verb `which` failed     at D:OpenServerOSPaneldomainsКурсBudgetbudget-appnode_modulesisexewindows.js:36:5
  58. npm ERR! gyp verb `which` failed     at FSReqCallback.oncomplete (node:fs:195:21) {
  59. npm ERR! gyp verb `which` failed   code: 'ENOENT'
  60. npm ERR! gyp verb `which` failed }
  61. npm ERR! gyp verb could not find "python". checking python launcher
  62. npm ERR! gyp verb check python launcher python executable found: "C:\Users\79606\.windows-build-tools\python27\python.exe"
  63. npm ERR! gyp verb check python version `C:Users79606.windows-build-toolspython27python.exe -c "import sys; print "2.7.16
  64. npm ERR! gyp verb check python version .%s.%s" % sys.version_info[:3];"` returned: %j
  65. npm ERR! gyp verb get node dir no --target version specified, falling back to host node version: 16.3.0
  66. npm ERR! gyp verb command install [ '16.3.0' ]
  67. npm ERR! gyp verb install input version string "16.3.0"
  68. npm ERR! gyp verb install installing version: 16.3.0
  69. npm ERR! gyp verb install --ensure was passed, so won't reinstall if already installed
  70. npm ERR! gyp verb install version is already installed, need to check "installVersion"
  71. npm ERR! gyp verb got "installVersion" 9
  72. npm ERR! gyp verb needs "installVersion" 9
  73. npm ERR! gyp verb install version is good
  74. npm ERR! gyp verb get node dir target node version installed: 16.3.0npm ERR! gyp verb build dir attempting to create "build" dir: D:OpenServerOSPaneldomainsКурсBudgetbudget-appnode_modulesnode-sassbuild
  75. npm ERR! gyp verb build dir "build" dir needed to be created? D:OpenServerOSPaneldomainsКурсBudgetbudget-appnode_modulesnode-sassbuild
  76. npm ERR! gyp verb find vs2017 Found installation at: C:Program Files (x86)Microsoft Visual Studio2019BuildTools
  77. npm ERR! gyp verb find vs2017   - Found Microsoft.VisualStudio.Component.VC.Tools.x86.x64
  78. npm ERR! gyp verb find vs2017   - Found Microsoft.VisualStudio.VC.MSBuild.Base
  79. npm ERR! gyp verb find vs2017   - Missing a Windows SDK (Microsoft.VisualStudio.Component.Windows10SDK.* or Microsoft.VisualStudio.Component.Windows81SDK)
  80. npm ERR! gyp verb find vs2017   - Some required components are missing, not using this installation
  81. npm ERR! gyp verb find vs2017 Found installation at: C:Program Files (x86)Microsoft Visual Studio2019Professional
  82. npm ERR! gyp verb find vs2017   - Found Microsoft.VisualStudio.Component.Windows10SDK.18362
  83. npm ERR! gyp verb find vs2017   - Found Microsoft.VisualStudio.Component.VC.Tools.x86.x64
  84. npm ERR! gyp verb find vs2017   - Found Microsoft.VisualStudio.VC.MSBuild.Base
  85. npm ERR! gyp verb find vs2017   - Using this installation with Windows 10 SDK
  86. npm ERR! gyp verb find vs2017 using installation: C:Program Files (x86)Microsoft Visual Studio2019Professional
  87. npm ERR! gyp verb build/config.gypi creating config file
  88. npm ERR! gyp verb build/config.gypi writing out config file: D:OpenServerOSPaneldomainsКурсBudgetbudget-appnode_modulesnode-sassbuildconfig.gypi
  89. npm ERR! (node:124) [DEP0150] DeprecationWarning: Setting process.config is deprecated. In the future the property will be read-only.  
  90. npm ERR! (Use `node --trace-deprecation ...` to show where the warning was created)
  91. npm ERR! gyp verb config.gypi checking for gypi file: D:OpenServerOSPaneldomainsКурсBudgetbudget-appnode_modulesnode-sassconfig.gypi
  92. npm ERR! gyp verb common.gypi checking for gypi file: D:OpenServerOSPaneldomainsКурсBudgetbudget-appnode_modulesnode-sasscommon.gypi
  93. npm ERR! gyp verb gyp gyp format was not specified; forcing "msvs"
  94. npm ERR! gyp info spawn C:Users79606.windows-build-toolspython27python.exe
  95. npm ERR! gyp info spawn args [
  96. npm ERR! gyp info spawn args   'D:\OpenServer\OSPanel\domains\Курс\Budget\budget-app\node_modules\node-gyp\gyp\gyp_main.py',  
  97. npm ERR! gyp info spawn args   'binding.gyp',
  98. npm ERR! gyp info spawn args   '-f',
  99. npm ERR! gyp info spawn args   'msvs',
  100. npm ERR! gyp info spawn args   '-G',
  101. npm ERR! gyp info spawn args   'msvs_version=2015',
  102. npm ERR! gyp info spawn args   '-I',
  103. npm ERR! gyp info spawn args   'D:\OpenServer\OSPanel\domains\Курс\Budget\budget-app\node_modules\node-sass\build\config.gypi',
  104. npm ERR! gyp info spawn args   '-I',
  105. npm ERR! gyp info spawn args   'D:\OpenServer\OSPanel\domains\Курс\Budget\budget-app\node_modules\node-gyp\addon.gypi',        
  106. npm ERR! gyp info spawn args   '-I',
  107. npm ERR! gyp info spawn args   'C:\Users\79606\.node-gyp\16.3.0\include\node\common.gypi',
  108. npm ERR! gyp info spawn args   '-Dlibrary=shared_library',
  109. npm ERR! gyp info spawn args   '-Dvisibility=default',
  110. npm ERR! gyp info spawn args   '-Dnode_root_dir=C:\Users\79606\.node-gyp\16.3.0',
  111. npm ERR! gyp info spawn args   '-Dnode_gyp_dir=D:\OpenServer\OSPanel\domains\Курс\Budget\budget-app\node_modules\node-gyp',    
  112. npm ERR! gyp info spawn args   '-Dnode_lib_file=C:\Users\79606\.node-gyp\16.3.0\<(target_arch)\node.lib',
  113. npm ERR! gyp info spawn args   '-Dmodule_root_dir=D:\OpenServer\OSPanel\domains\Курс\Budget\budget-app\node_modules\node-sass',
  114. npm ERR! gyp info spawn args   '-Dnode_engine=v8',
  115. npm ERR! gyp info spawn args   '--depth=.',
  116. npm ERR! gyp info spawn args   '--no-parallel',
  117. npm ERR! gyp info spawn args   '--generator-output',
  118. npm ERR! gyp info spawn args   'D:\OpenServer\OSPanel\domains\Курс\Budget\budget-app\node_modules\node-sass\build',
  119. npm ERR! gyp info spawn args   '-Goutput_dir=.'
  120. npm ERR! gyp info spawn args ]
  121. npm ERR! gyp verb command build []
  122. npm ERR! gyp verb build type Release
  123. npm ERR! gyp verb architecture x64
  124. npm ERR! gyp verb node dev dir C:Users79606.node-gyp16.3.0      
  125. npm ERR! gyp verb found first Solution file build/binding.sln      
  126. npm ERR! gyp verb using MSBuild: C:Program Files (x86)Microsoft Visual Studio2019ProfessionalMSBuild15.0BinMSBuild.exe
  127. npm ERR! gyp info spawn C:Program Files (x86)Microsoft Visual Studio2019ProfessionalMSBuild15.0BinMSBuild.exe
  128. npm ERR! gyp info spawn args [
  129. npm ERR! gyp info spawn args   'build/binding.sln',
  130. npm ERR! gyp info spawn args   '/nologo',
  131. npm ERR! gyp info spawn args   '/p:Configuration=Release;Platform=x64'
  132. npm ERR! gyp info spawn args ]
  133. npm ERR! gyp ERR! UNCAUGHT EXCEPTION
  134. npm ERR! gyp ERR! stack Error: spawn C:Program Files (x86)Microsoft Visual Studio2019ProfessionalMSBuild15.0BinMSBuild.exe ENOENT
  135. npm ERR! gyp ERR! stack     at Process.ChildProcess._handle.onexit (node:internal/child_process:282:19)
  136. npm ERR! gyp ERR! stack     at onErrorNT (node:internal/child_process:480:16)
  137. npm ERR! gyp ERR! stack     at processTicksAndRejections (node:internal/process/task_queues:83:21)
  138. npm ERR! gyp ERR! System Windows_NT 10.0.19041
  139. npm ERR! gyp ERR! command "C:\Program Files\nodejs\node.exe" "D:\OpenServer\OSPanel\domains\Курс\Budget\budget-app\node_modules\node-gyp\bin\node-gyp.js" "rebuild" "--verbose" "--libsass_ext=" "--libsass_cflags=" "--libsass_ldflags=" "--libsass_library="    
  140. npm ERR! gyp ERR! cwd D:OpenServerOSPaneldomainsКурсBudgetbudget-appnode_modulesnode-sass
  141. npm ERR! gyp ERR! node -v v16.3.0
  142. npm ERR! gyp ERR! node-gyp -v v3.8.0
  143. npm ERR! gyp ERR! This is a bug in `node-gyp`.
  144. npm ERR! gyp ERR! Try to update node-gyp and file an Issue if it does not help:
  145. npm ERR! gyp ERR!     <https://github.com/nodejs/node-gyp/issues>  
  146. npm ERR! Build failed with error code: 7
  147.  
  148. npm ERR! A complete log of this run can be found in:
  149. npm ERR!     C:Users79606AppDataLocalnpm-cache_logs2021-06-24T07_52_38_126Z-debug.log
  150.  ERROR  command failed: npm install --loglevel error --legacy-peer-deps

Share with your friends:

Print