SaveText.Ru

Вывод ошибки OpenGL
  1. Microsoft Windows [Version 10.0.18363.1440]
  2. (c) Корпорация Майкрософт (Microsoft Corporation), 2019. Все права защищены.
  3.  
  4. C:Usersavkolcg>g++ -o test.exe test.cpp -lglew32 -lfreeglut -lopengl32 -lglu32 -Wl,--subsystem,windows
  5. c:/users/avkol/gcc/bin/../lib/gcc/x86_64-w64-mingw32/10.2.0/../../../../x86_64-w64-mingw32/bin/ld.exe: cannot find -lglew32
  6. c:/users/avkol/gcc/bin/../lib/gcc/x86_64-w64-mingw32/10.2.0/../../../../x86_64-w64-mingw32/bin/ld.exe: cannot find -lfreeglut
  7. collect2.exe: error: ld returned 1 exit status
  8.  
  9. C:Usersavkolcg>g++ -o test.exe test.cpp -lopengl32 -lglu32 -Wl,--subsystem,windows
  10. C:UsersavkolAppDataLocalTempccDIvJ2H.o:test.cpp:(.text+0x25): undefined reference to `__imp___glutInitWithExit'
  11. C:UsersavkolAppDataLocalTempccDIvJ2H.o:test.cpp:(.text+0x4c): undefined reference to `__imp___glutCreateWindowWithExit'
  12. C:UsersavkolAppDataLocalTempccDIvJ2H.o:test.cpp:(.text+0x72): undefined reference to `__imp___glutCreateMenuWithExit'
  13. C:UsersavkolAppDataLocalTempccDIvJ2H.o:test.cpp:(.text+0xaa): undefined reference to `__imp_glutInitDisplayMode'
  14. C:UsersavkolAppDataLocalTempccDIvJ2H.o:test.cpp:(.text+0xbd): undefined reference to `__imp_glutInitWindowSize'
  15. C:UsersavkolAppDataLocalTempccDIvJ2H.o:test.cpp:(.text+0xd0): undefined reference to `__imp_glutInitContextVersion'
  16. C:UsersavkolAppDataLocalTempccDIvJ2H.o:test.cpp:(.text+0xde): undefined reference to `__imp_glutInitContextProfile'
  17. C:UsersavkolAppDataLocalTempccDIvJ2H.o:test.cpp:(.text+0xf6): undefined reference to `__imp_glewInit'
  18. C:UsersavkolAppDataLocalTempccDIvJ2H.o:test.cpp:(.text+0x125): undefined reference to `__imp_glutMainLoop'
  19. collect2.exe: error: ld returned 1 exit status
  20.  
  21. C:Usersavkolcg>g++ -o test.exe test.cpp
  22. test.cpp:2:10: fatal error: GL/glew.h: No such file or directory
  23.    2 | #include <GL/glew.h>
  24.      |          ^~~~~~~~~~~
  25. compilation terminated.
  26.  
  27. C:Usersavkolcg>g++ -o test.exe test.cpp
  28. C:UsersavkolAppDataLocalTempccn31irJ.o:test.cpp:(.text+0x25): undefined reference to `__imp___glutInitWithExit'
  29. C:UsersavkolAppDataLocalTempccn31irJ.o:test.cpp:(.text+0x4c): undefined reference to `__imp___glutCreateWindowWithExit'
  30. C:UsersavkolAppDataLocalTempccn31irJ.o:test.cpp:(.text+0x72): undefined reference to `__imp___glutCreateMenuWithExit'
  31. C:UsersavkolAppDataLocalTempccn31irJ.o:test.cpp:(.text+0xaa): undefined reference to `__imp_glutInitDisplayMode'
  32. C:UsersavkolAppDataLocalTempccn31irJ.o:test.cpp:(.text+0xbd): undefined reference to `__imp_glutInitWindowSize'
  33. C:UsersavkolAppDataLocalTempccn31irJ.o:test.cpp:(.text+0xd0): undefined reference to `__imp_glutInitContextVersion'
  34. C:UsersavkolAppDataLocalTempccn31irJ.o:test.cpp:(.text+0xde): undefined reference to `__imp_glutInitContextProfile'
  35. C:UsersavkolAppDataLocalTempccn31irJ.o:test.cpp:(.text+0xf6): undefined reference to `__imp_glewInit'
  36. C:UsersavkolAppDataLocalTempccn31irJ.o:test.cpp:(.text+0x125): undefined reference to `__imp_glutMainLoop'
  37. collect2.exe: error: ld returned 1 exit status
  38.  
  39. C:Usersavkolcg>g++ -o test.exe test.cpp -lopengl32 -lglu32 -Wl,--subsystem,windows -I"C:MinGWinclude" -L"C:MinGWlib"
  40. In file included from C:MinGWinclude/wchar.h:54,
  41.                  from c:usersavkolgccincludec++10.2.0cwchar:44,
  42.                  from c:usersavkolgccincludec++10.2.0bitspostypes.h:40,
  43.                  from c:usersavkolgccincludec++10.2.0iosfwd:40,
  44.                  from c:usersavkolgccincludec++10.2.0ios:38,
  45.                  from c:usersavkolgccincludec++10.2.0ostream:38,
  46.                  from c:usersavkolgccincludec++10.2.0iostream:39,
  47.                  from test.cpp:1:
  48. C:MinGWinclude/_mingw.h:413:3: warning: #warning "Direct definition of __USE_MINGW_ANSI_STDIO is deprecated." [-Wcpp]
  49.   413 | # warning "Direct definition of __USE_MINGW_ANSI_STDIO is deprecated."
  50.       |   ^~~~~~~
  51. In file included from C:MinGWinclude/windef.h:269,
  52.                  from C:MinGWinclude/windows.h:42,
  53.                  from C:/MinGW/include/GL/freeglut_std.h:63,
  54.                  from C:/MinGW/include/GL/freeglut.h:17,
  55.                  from test.cpp:3:
  56. C:MinGWinclude/winnt.h:2436:2: error: #error "undefined processor type"
  57.  2436 | #error "undefined processor type"
  58.       |  ^~~~~
  59. In file included from C:MinGWinclude/wchar.h:54,
  60.                  from c:usersavkolgccincludec++10.2.0cwchar:44,
  61.                  from c:usersavkolgccincludec++10.2.0bitspostypes.h:40,
  62.                  from c:usersavkolgccincludec++10.2.0iosfwd:40,
  63.                  from c:usersavkolgccincludec++10.2.0ios:38,
  64.                  from c:usersavkolgccincludec++10.2.0ostream:38,
  65.                  from c:usersavkolgccincludec++10.2.0iostream:39,
  66.                  from test.cpp:1:
  67. C:MinGWinclude/_mingw.h:414:18: note: '#pragma message: See <_mingw.h> for preferred feature activation methods.'
  68.   414 | # pragma message "See <_mingw.h> for preferred feature activation methods."
  69.       |                  ^~~~~~~~~~~~~~~~~~~~~~~~~~~~~~~~~~~~~~~~~~~~~~~~~~~~~~~~~~
  70. In file included from c:usersavkolgccx86_64-w64-mingw32includestddef.h:7,
  71.                  from c:usersavkolgcclibgccx86_64-w64-mingw3210.2.0includestddef.h:1,
  72.                  from C:MinGWinclude/wctype.h:87,
  73.                  from C:MinGWinclude/wchar.h:62,
  74.                  from c:usersavkolgccincludec++10.2.0cwchar:44,
  75.                  from c:usersavkolgccincludec++10.2.0bitspostypes.h:40,
  76.                  from c:usersavkolgccincludec++10.2.0iosfwd:40,
  77.                  from c:usersavkolgccincludec++10.2.0ios:38,
  78.                  from c:usersavkolgccincludec++10.2.0ostream:38,
  79.                  from c:usersavkolgccincludec++10.2.0iostream:39,
  80.                  from test.cpp:1:
  81. c:usersavkolgccx86_64-w64-mingw32includecrtdefs.h:35:1: error: '__MINGW_EXTENSION' does not name a type
  82.    35 | __MINGW_EXTENSION typedef unsigned __int64 size_t;
  83.       | ^~~~~~~~~~~~~~~~~
  84. c:usersavkolgccx86_64-w64-mingw32includecrtdefs.h:45:1: error: '__MINGW_EXTENSION' does not name a type
  85.    45 | __MINGW_EXTENSION typedef __int64 ssize_t;
  86.       | ^~~~~~~~~~~~~~~~~
  87. c:usersavkolgccx86_64-w64-mingw32includecrtdefs.h:52:9: error: 'size_t' does not name a type
  88.    52 | typedef size_t rsize_t;
  89.       |         ^~~~~~
  90. c:usersavkolgccx86_64-w64-mingw32includecrtdefs.h:1:1: note: 'size_t' is defined in header '<cstddef>'; did you forget to '#include <cstddef>'?
  91.   +++ |+#include <cstddef>
  92.     1 | /**
  93. c:usersavkolgccx86_64-w64-mingw32includecrtdefs.h:62:1: error: '__MINGW_EXTENSION' does not name a type
  94.    62 | __MINGW_EXTENSION typedef __int64 intptr_t;
  95.       | ^~~~~~~~~~~~~~~~~
  96. c:usersavkolgccx86_64-w64-mingw32includecrtdefs.h:75:1: error: '__MINGW_EXTENSION' does not name a type
  97.    75 | __MINGW_EXTENSION typedef unsigned __int64 uintptr_t;
  98.       | ^~~~~~~~~~~~~~~~~
  99. c:usersavkolgccx86_64-w64-mingw32includecrtdefs.h:88:1: error: '__MINGW_EXTENSION' does not name a type
  100.    88 | __MINGW_EXTENSION typedef __int64 ptrdiff_t;
  101.       | ^~~~~~~~~~~~~~~~~
  102. c:usersavkolgccx86_64-w64-mingw32includecrtdefs.h:123:1: error: '__MINGW_EXTENSION' does not name a type
  103.   123 | __MINGW_EXTENSION typedef __int64 __time64_t;
  104.       | ^~~~~~~~~~~~~~~~~
  105. c:usersavkolgccx86_64-w64-mingw32includecrtdefs.h:138:9: error: '__time64_t' does not name a type; did you mean '__time32_t'?
  106.   138 | typedef __time64_t time_t;
  107.       |         ^~~~~~~~~~
  108.       |         __time32_t
  109. In file included from c:usersavkolgcclibgccx86_64-w64-mingw3210.2.0includestddef.h:1,
  110.                  from C:MinGWinclude/wctype.h:87,
  111.                  from C:MinGWinclude/wchar.h:62,
  112.                  from c:usersavkolgccincludec++10.2.0cwchar:44,
  113.                  from c:usersavkolgccincludec++10.2.0bitspostypes.h:40,
  114.                  from c:usersavkolgccincludec++10.2.0iosfwd:40,
  115.                  from c:usersavkolgccincludec++10.2.0ios:38,
  116.                  from c:usersavkolgccincludec++10.2.0ostream:38,
  117.                  from c:usersavkolgccincludec++10.2.0iostream:39,
  118.                  from test.cpp:1:
  119. c:usersavkolgccx86_64-w64-mingw32includestddef.h:26:18: error: 'uintptr_t' does not name a type
  120.    26 |   _CRTIMP extern uintptr_t __cdecl __threadhandle(void);
  121.       |                  ^~~~~~~~~
  122. In file included from C:MinGWinclude/wchar.h:62,
  123.                  from c:usersavkolgccincludec++10.2.0cwchar:44,
  124.                  from c:usersavkolgccincludec++10.2.0bitspostypes.h:40,
  125.                  from c:usersavkolgccincludec++10.2.0iosfwd:40,
  126.                  from c:usersavkolgccincludec++10.2.0ios:38,
  127.                  from c:usersavkolgccincludec++10.2.0ostream:38,
  128.                  from c:usersavkolgccincludec++10.2.0iostream:39,
  129.                  from test.cpp:1:
  130. C:MinGWinclude/wctype.h:89:18: error: conflicting declaration 'typedef wchar_t wctype_t'
  131.    89 | typedef wchar_t  wctype_t;
  132.       |                  ^~~~~~~~
  133. In file included from c:usersavkolgccx86_64-w64-mingw32includestddef.h:7,
  134.                  from c:usersavkolgcclibgccx86_64-w64-mingw3210.2.0includestddef.h:1,
  135.                  from C:MinGWinclude/wctype.h:87,
  136.                  from C:MinGWinclude/wchar.h:62,
  137.                  from c:usersavkolgccincludec++10.2.0cwchar:44,
  138.                  from c:usersavkolgccincludec++10.2.0bitspostypes.h:40,
  139.                  from c:usersavkolgccincludec++10.2.0iosfwd:40,
  140.                  from c:usersavkolgccincludec++10.2.0ios:38,
  141.                  from c:usersavkolgccincludec++10.2.0ostream:38,
  142.                  from c:usersavkolgccincludec++10.2.0iostream:39,
  143.                  from test.cpp:1:
  144. c:usersavkolgccx86_64-w64-mingw32includecrtdefs.h:107:24: note: previous declaration as 'typedef short unsigned int wctype_t'
  145.   107 | typedef unsigned short wctype_t;
  146.       |                        ^~~~~~~~
  147. In file included from C:MinGWinclude/wchar.h:84,
  148.                  from c:usersavkolgccincludec++10.2.0cwchar:44,
  149.                  from c:usersavkolgccincludec++10.2.0bitspostypes.h:40,
  150.                  from c:usersavkolgccincludec++10.2.0iosfwd:40,
  151.                  from c:usersavkolgccincludec++10.2.0ios:38,
  152.                  from c:usersavkolgccincludec++10.2.0ostream:38,
  153.                  from c:usersavkolgccincludec++10.2.0iostream:39,
  154.                  from test.cpp:1:
  155. C:MinGWinclude/stdio.h:1045:64: error: 'size_t' has not been declared
  156.  1045 | _CRTIMP __cdecl __MINGW_NOTHROW  int    _snwprintf (wchar_t *, size_t, const wchar_t *, ...);
  157.       |                                                                ^~~~~~
  158. C:MinGWinclude/stdio.h:1047:65: error: 'size_t' has not been declared
  159.  1047 | _CRTIMP __cdecl __MINGW_NOTHROW  int    _vsnwprintf (wchar_t *, size_t, const wchar_t *, __VALIST);
  160.       |                                                                 ^~~~~~
  161. C:MinGWinclude/stdio.h:1089:52: error: 'size_t' has not been declared
  162.  1089 | __cdecl __MINGW_NOTHROW  int snwprintf (wchar_t *, size_t, const wchar_t *, ...);
  163.       |                                                    ^~~~~~
  164. C:MinGWinclude/stdio.h:1090:53: error: 'size_t' has not been declared
  165.  1090 | __cdecl __MINGW_NOTHROW  int vsnwprintf (wchar_t *, size_t, const wchar_t *, __VALIST);
  166.       |                                                     ^~~~~~
  167. In file included from C:MinGWinclude/wchar.h:148,
  168.                  from c:usersavkolgccincludec++10.2.0cwchar:44,
  169.                  from c:usersavkolgccincludec++10.2.0bitspostypes.h:40,
  170.                  from c:usersavkolgccincludec++10.2.0iosfwd:40,
  171.                  from c:usersavkolgccincludec++10.2.0ios:38,
  172.                  from c:usersavkolgccincludec++10.2.0ostream:38,
  173.                  from c:usersavkolgccincludec++10.2.0iostream:39,
  174.                  from test.cpp:1:
  175. C:MinGWinclude/stdlib.h:509:50: error: 'size_t' has not been declared
  176.   509 | wchar_t *_wfullpath (wchar_t *, const wchar_t *, size_t);
  177.       |                                                  ^~~~~~
  178. In file included from C:MinGWinclude/wchar.h:308,
  179.                  from c:usersavkolgccincludec++10.2.0cwchar:44,
  180.                  from c:usersavkolgccincludec++10.2.0bitspostypes.h:40,
  181.                  from c:usersavkolgccincludec++10.2.0iosfwd:40,
  182.                  from c:usersavkolgccincludec++10.2.0ios:38,
  183.                  from c:usersavkolgccincludec++10.2.0ostream:38,
  184.                  from c:usersavkolgccincludec++10.2.0iostream:39,
  185.                  from test.cpp:1:
  186. C:MinGWinclude/time.h:538:1: error: 'size_t' does not name a type
  187.   538 | size_t wcsftime (wchar_t *, size_t, const wchar_t *, const struct tm *);
  188.       | ^~~~~~
  189. In file included from C:MinGWinclude/wchar.h:308,
  190.                  from c:usersavkolgccincludec++10.2.0cwchar:44,
  191.                  from c:usersavkolgccincludec++10.2.0bitspostypes.h:40,
  192.                  from c:usersavkolgccincludec++10.2.0iosfwd:40,
  193.                  from c:usersavkolgccincludec++10.2.0ios:38,
  194.                  from c:usersavkolgccincludec++10.2.0ostream:38,
  195.                  from c:usersavkolgccincludec++10.2.0iostream:39,
  196.                  from test.cpp:1:
  197. C:MinGWinclude/time.h:1:1: note: 'size_t' is defined in header '<cstddef>'; did you forget to '#include <cstddef>'?
  198.   +++ |+#include <cstddef>
  199.     1 | /*
  200. In file included from c:usersavkolgccincludec++10.2.0cwchar:44,
  201.                  from c:usersavkolgccincludec++10.2.0bitspostypes.h:40,
  202.                  from c:usersavkolgccincludec++10.2.0iosfwd:40,
  203.                  from c:usersavkolgccincludec++10.2.0ios:38,
  204.                  from c:usersavkolgccincludec++10.2.0ostream:38,
  205.                  from c:usersavkolgccincludec++10.2.0iostream:39,
  206.                  from test.cpp:1:
  207. C:MinGWinclude/wchar.h:415:34: error: 'size_t' does not name a type
  208.   415 | _CRTIMP __cdecl __MINGW_NOTHROW  size_t wcscspn (const wchar_t *, const wchar_t *);
  209.       |                                  ^~~~~~
  210. C:MinGWinclude/wchar.h:355:1: note: 'size_t' is defined in header '<cstddef>'; did you forget to '#include <cstddef>'?
  211.   354 | #include "process.h"
  212.   +++ |+#include <cstddef>
  213.   355 | /* ...we obtain function prototypes for:
  214. C:MinGWinclude/wchar.h:416:34: error: 'size_t' does not name a type
  215.   416 | _CRTIMP __cdecl __MINGW_NOTHROW  size_t wcslen (const wchar_t *);
  216.       |                                  ^~~~~~
  217. C:MinGWinclude/wchar.h:416:34: note: 'size_t' is defined in header '<cstddef>'; did you forget to '#include <cstddef>'?
  218. C:MinGWinclude/wchar.h:417:80: error: 'size_t' has not been declared
  219.   417 | _CRTIMP __cdecl __MINGW_NOTHROW  wchar_t *wcsncat (wchar_t *, const wchar_t *, size_t);
  220.       |                                                                                ^~~~~~
  221. C:MinGWinclude/wchar.h:418:81: error: 'size_t' has not been declared
  222.   418 | _CRTIMP __cdecl __MINGW_NOTHROW  int wcsncmp (const wchar_t *, const wchar_t *, size_t);
  223.       |                                                                                 ^~~~~~
  224. C:MinGWinclude/wchar.h:419:80: error: 'size_t' has not been declared
  225.   419 | _CRTIMP __cdecl __MINGW_NOTHROW  wchar_t *wcsncpy (wchar_t *, const wchar_t *, size_t);
  226.       |                                                                                ^~~~~~
  227. C:MinGWinclude/wchar.h:422:34: error: 'size_t' does not name a type
  228.   422 | _CRTIMP __cdecl __MINGW_NOTHROW  size_t wcsspn (const wchar_t *, const wchar_t *);
  229.       |                                  ^~~~~~
  230. C:MinGWinclude/wchar.h:422:34: note: 'size_t' is defined in header '<cstddef>'; did you forget to '#include <cstddef>'?
  231. C:MinGWinclude/wchar.h:425:34: error: 'size_t' does not name a type
  232.   425 | _CRTIMP __cdecl __MINGW_NOTHROW  size_t wcsxfrm (wchar_t *, const wchar_t *, size_t);
  233.       |                                  ^~~~~~
  234. C:MinGWinclude/wchar.h:425:34: note: 'size_t' is defined in header '<cstddef>'; did you forget to '#include <cstddef>'?
  235. C:MinGWinclude/wchar.h:434:83: error: 'size_t' has not been declared
  236.   434 | _CRTIMP __cdecl __MINGW_NOTHROW  int _wcsnicmp (const wchar_t *, const wchar_t *, size_t);
  237.       |                                                                                   ^~~~~~
  238. C:MinGWinclude/wchar.h:435:73: error: 'size_t' has not been declared
  239.   435 | _CRTIMP __cdecl __MINGW_NOTHROW  wchar_t *_wcsnset (wchar_t *, wchar_t, size_t);
  240.       |                                                                         ^~~~~~
  241. C:MinGWinclude/wchar.h:441:83: error: 'size_t' has not been declared
  242.   441 | _CRTIMP __cdecl __MINGW_NOTHROW  int _wcsncoll (const wchar_t *, const wchar_t *, size_t);
  243.       |                                                                                   ^~~~~~
  244. C:MinGWinclude/wchar.h:442:84: error: 'size_t' has not been declared
  245.   442 | _CRTIMP __cdecl __MINGW_NOTHROW  int _wcsnicoll (const wchar_t *, const wchar_t *, size_t);
  246.       |                                                                                    ^~~~~~
  247. C:MinGWinclude/wchar.h:479:82: error: 'size_t' has not been declared
  248.   479 | _CRTIMP __cdecl __MINGW_NOTHROW  int wcsnicmp (const wchar_t *, const wchar_t *, size_t);
  249.       |                                                                                  ^~~~~~
  250. C:MinGWinclude/wchar.h:480:72: error: 'size_t' has not been declared
  251.   480 | _CRTIMP __cdecl __MINGW_NOTHROW  wchar_t *wcsnset (wchar_t *, wchar_t, size_t);
  252.       |                                                                        ^~~~~~
  253. C:MinGWinclude/wchar.h:509:8: error: 'size_t' does not name a type
  254.   509 | extern size_t __mingw_wcsnlen (const wchar_t *, size_t);
  255.       |        ^~~~~~
  256. C:MinGWinclude/wchar.h:509:8: note: 'size_t' is defined in header '<cstddef>'; did you forget to '#include <cstddef>'?
  257. C:MinGWinclude/wchar.h:512:13: error: 'size_t' does not name a type
  258.   512 | __CRT_ALIAS size_t wcsnlen (const wchar_t *__text, size_t __maxlen)
  259.       |             ^~~~~~
  260. C:MinGWinclude/wchar.h:512:13: note: 'size_t' is defined in header '<cstddef>'; did you forget to '#include <cstddef>'?
  261. C:MinGWinclude/wchar.h:542:26: error: 'size_t' does not name a type
  262.   542 | __cdecl __MINGW_NOTHROW  size_t mbrlen
  263.       |                          ^~~~~~
  264. C:MinGWinclude/wchar.h:542:26: note: 'size_t' is defined in header '<cstddef>'; did you forget to '#include <cstddef>'?
  265. C:MinGWinclude/wchar.h:545:26: error: 'size_t' does not name a type
  266.   545 | __cdecl __MINGW_NOTHROW  size_t mbrtowc
  267.       |                          ^~~~~~
  268. C:MinGWinclude/wchar.h:545:26: note: 'size_t' is defined in header '<cstddef>'; did you forget to '#include <cstddef>'?
  269. C:MinGWinclude/wchar.h:548:26: error: 'size_t' does not name a type
  270.   548 | __cdecl __MINGW_NOTHROW  size_t mbsrtowcs
  271.       |                          ^~~~~~
  272. C:MinGWinclude/wchar.h:548:26: note: 'size_t' is defined in header '<cstddef>'; did you forget to '#include <cstddef>'?
  273. C:MinGWinclude/wchar.h:551:26: error: 'size_t' does not name a type
  274.   551 | __cdecl __MINGW_NOTHROW  size_t wcrtomb
  275.       |                          ^~~~~~
  276. C:MinGWinclude/wchar.h:551:26: note: 'size_t' is defined in header '<cstddef>'; did you forget to '#include <cstddef>'?
  277. C:MinGWinclude/wchar.h:554:26: error: 'size_t' does not name a type
  278.   554 | __cdecl __MINGW_NOTHROW  size_t wcsrtombs
  279.       |                          ^~~~~~
  280. C:MinGWinclude/wchar.h:554:26: note: 'size_t' is defined in header '<cstddef>'; did you forget to '#include <cstddef>'?
  281. C:MinGWinclude/wchar.h:576:64: error: 'size_t' has not been declared
  282.   576 | __cdecl __MINGW_NOTHROW  wchar_t *wmemset (wchar_t *, wchar_t, size_t);
  283.       |                                                                ^~~~~~
  284. C:MinGWinclude/wchar.h:577:70: error: 'size_t' has not been declared
  285.   577 | __cdecl __MINGW_NOTHROW  wchar_t *wmemchr (const wchar_t *, wchar_t, size_t);
  286.       |                                                                      ^~~~~~
  287. C:MinGWinclude/wchar.h:583:48: error: 'size_t' has not been declared
  288.   583 | int wmemcmp (const wchar_t *, const wchar_t *, size_t);
  289.       |                                                ^~~~~~
  290. C:MinGWinclude/wchar.h:586:71: error: 'size_t' has not been declared
  291.   586 | wchar_t *wmemcpy (wchar_t *__restrict__, const wchar_t *__restrict__, size_t);
  292.       |                                                                       ^~~~~~
  293. C:MinGWinclude/wchar.h:588:73: error: 'size_t' has not been declared
  294.   588 | __cdecl __MINGW_NOTHROW  wchar_t *wmemmove (wchar_t *, const wchar_t *, size_t);
  295.       |                                                                         ^~~~~~
  296. In file included from c:usersavkolgccincludec++10.2.0bitspostypes.h:40,
  297.                  from c:usersavkolgccincludec++10.2.0iosfwd:40,
  298.                  from c:usersavkolgccincludec++10.2.0ios:38,
  299.                  from c:usersavkolgccincludec++10.2.0ostream:38,
  300.                  from c:usersavkolgccincludec++10.2.0iostream:39,
  301.                  from test.cpp:1:
  302. c:usersavkolgccincludec++10.2.0cwchar:153:11: error: 'mbrlen' has not been declared in '::'
  303.   153 |   using ::mbrlen;
  304.       |           ^~~~~~
  305. c:usersavkolgccincludec++10.2.0cwchar:154:11: error: 'mbrtowc' has not been declared in '::'
  306.   154 |   using ::mbrtowc;
  307.       |           ^~~~~~~
  308. c:usersavkolgccincludec++10.2.0cwchar:156:11: error: 'mbsrtowcs' has not been declared in '::'
  309.   156 |   using ::mbsrtowcs;
  310.       |           ^~~~~~~~~
  311. c:usersavkolgccincludec++10.2.0cwchar:178:11: error: 'wcrtomb' has not been declared in '::'
  312.   178 |   using ::wcrtomb;
  313.       |           ^~~~~~~
  314. c:usersavkolgccincludec++10.2.0cwchar:183:11: error: 'wcscspn' has not been declared in '::'
  315.   183 |   using ::wcscspn;
  316.       |           ^~~~~~~
  317. c:usersavkolgccincludec++10.2.0cwchar:184:11: error: 'wcsftime' has not been declared in '::'
  318.   184 |   using ::wcsftime;
  319.       |           ^~~~~~~~
  320. c:usersavkolgccincludec++10.2.0cwchar:185:11: error: 'wcslen' has not been declared in '::'
  321.   185 |   using ::wcslen;
  322.       |           ^~~~~~
  323. c:usersavkolgccincludec++10.2.0cwchar:189:11: error: 'wcsrtombs' has not been declared in '::'
  324.   189 |   using ::wcsrtombs;
  325.       |           ^~~~~~~~~
  326. c:usersavkolgccincludec++10.2.0cwchar:190:11: error: 'wcsspn' has not been declared in '::'
  327.   190 |   using ::wcsspn;
  328.       |           ^~~~~~
  329. c:usersavkolgccincludec++10.2.0cwchar:198:11: error: 'wcsxfrm' has not been declared in '::'
  330.   198 |   using ::wcsxfrm;
  331.       |           ^~~~~~~
  332. In file included from c:usersavkolgccincludec++10.2.0bitsexception_ptr.h:38,
  333.                  from c:usersavkolgccincludec++10.2.0exception:147,
  334.                  from c:usersavkolgccincludec++10.2.0ios:39,
  335.                  from c:usersavkolgccincludec++10.2.0ostream:38,
  336.                  from c:usersavkolgccincludec++10.2.0iostream:39,
  337.                  from test.cpp:1:
  338. c:usersavkolgccincludec++10.2.0bitscxxabi_init_exception.h:63:32: error: 'size_t' was not declared in this scope; did you mean 'std::size_t'?
  339.    63 |       __cxa_allocate_exception(size_t) _GLIBCXX_NOTHROW;
  340.       |                                ^~~~~~
  341.       |                                std::size_t
  342. In file included from c:usersavkolgccincludec++10.2.0iostream:38,
  343.                  from test.cpp:1:
  344. c:usersavkolgccincludec++10.2.0x86_64-w64-mingw32bitsc++config.h:260:26: note: 'std::size_t' declared here
  345.   260 |   typedef __SIZE_TYPE__  size_t;
  346.       |                          ^~~~~~
  347. In file included from c:usersavkolgccincludec++10.2.0exception:147,
  348.                  from c:usersavkolgccincludec++10.2.0ios:39,
  349.                  from c:usersavkolgccincludec++10.2.0ostream:38,
  350.                  from c:usersavkolgccincludec++10.2.0iostream:39,
  351.                  from test.cpp:1:
  352. c:usersavkolgccincludec++10.2.0bitsexception_ptr.h: In function 'std::__exception_ptr::exception_ptr std::make_exception_ptr(_Ex)':
  353. c:usersavkolgccincludec++10.2.0bitsexception_ptr.h:189:67: error: '__cxxabiv1::__cxa_allocate_exception' cannot be used as a function
  354.   189 |       void* __e = __cxxabiv1::__cxa_allocate_exception(sizeof(_Ex));
  355.       |                                                                   ^
  356. In file included from c:usersavkolgccincludec++10.2.0ios:40,
  357.                  from c:usersavkolgccincludec++10.2.0ostream:38,
  358.                  from c:usersavkolgccincludec++10.2.0iostream:39,
  359.                  from test.cpp:1:
  360. c:usersavkolgccincludec++10.2.0bitschar_traits.h: In static member function 'static std::size_t std::char_traits<wchar_t>::length(const char_type*)':
  361. c:usersavkolgccincludec++10.2.0bitschar_traits.h:481:9: error: 'wcslen' was not declared in this scope; did you mean 'wcsset'?
  362.   481 |  return wcslen(__s);
  363.       |         ^~~~~~
  364.       |         wcsset
  365. In file included from c:usersavkolgccincludec++10.2.0cstdlib:75,
  366.                  from c:usersavkolgccincludec++10.2.0extstring_conversions.h:41,
  367.                  from c:usersavkolgccincludec++10.2.0bitsbasic_string.h:6535,
  368.                  from c:usersavkolgccincludec++10.2.0string:55,
  369.                  from c:usersavkolgccincludec++10.2.0bitslocale_classes.h:40,
  370.                  from c:usersavkolgccincludec++10.2.0bitsios_base.h:41,
  371.                  from c:usersavkolgccincludec++10.2.0ios:42,
  372.                  from c:usersavkolgccincludec++10.2.0ostream:38,
  373.                  from c:usersavkolgccincludec++10.2.0iostream:39,
  374.                  from test.cpp:1:
  375. c:usersavkolgccx86_64-w64-mingw32includestdlib.h: At global scope:
  376. c:usersavkolgccx86_64-w64-mingw32includestdlib.h:180:35: error: '__argc' was not declared in this scope
  377.   180 |   extern int * __MINGW_IMP_SYMBOL(__argc);
  378.       |                                   ^~~~~~
  379. c:usersavkolgccx86_64-w64-mingw32includestdlib.h:188:19: error: conflicting declaration 'char*** __MINGW_IMP_SYMBOL'
  380.   188 |   extern char *** __MINGW_IMP_SYMBOL(__argv);
  381.       |                   ^~~~~~~~~~~~~~~~~~
  382. c:usersavkolgccx86_64-w64-mingw32includestdlib.h:180:16: note: previous declaration as 'int* __MINGW_IMP_SYMBOL'
  383.   180 |   extern int * __MINGW_IMP_SYMBOL(__argc);
  384.       |                ^~~~~~~~~~~~~~~~~~
  385. c:usersavkolgccx86_64-w64-mingw32includestdlib.h:188:38: error: '__argv' was not declared in this scope
  386.   188 |   extern char *** __MINGW_IMP_SYMBOL(__argv);
  387.       |                                      ^~~~~~
  388. c:usersavkolgccx86_64-w64-mingw32includestdlib.h:196:22: error: conflicting declaration 'wchar_t*** __MINGW_IMP_SYMBOL'
  389.   196 |   extern wchar_t *** __MINGW_IMP_SYMBOL(__wargv);
  390.       |                      ^~~~~~~~~~~~~~~~~~
  391. c:usersavkolgccx86_64-w64-mingw32includestdlib.h:180:16: note: previous declaration as 'int* __MINGW_IMP_SYMBOL'
  392.   180 |   extern int * __MINGW_IMP_SYMBOL(__argc);
  393.       |                ^~~~~~~~~~~~~~~~~~
  394. c:usersavkolgccx86_64-w64-mingw32includestdlib.h:196:41: error: '__wargv' was not declared in this scope
  395.   196 |   extern wchar_t *** __MINGW_IMP_SYMBOL(__wargv);
  396.       |                                         ^~~~~~~
  397. c:usersavkolgccx86_64-w64-mingw32includestdlib.h:208:19: error: conflicting declaration 'char*** __MINGW_IMP_SYMBOL'
  398.   208 |   extern char *** __MINGW_IMP_SYMBOL(_environ);
  399.       |                   ^~~~~~~~~~~~~~~~~~
  400. c:usersavkolgccx86_64-w64-mingw32includestdlib.h:180:16: note: previous declaration as 'int* __MINGW_IMP_SYMBOL'
  401.   180 |   extern int * __MINGW_IMP_SYMBOL(__argc);
  402.       |                ^~~~~~~~~~~~~~~~~~
  403. c:usersavkolgccx86_64-w64-mingw32includestdlib.h:208:38: error: '_environ' was not declared in this scope
  404.   208 |   extern char *** __MINGW_IMP_SYMBOL(_environ);
  405.       |                                      ^~~~~~~~
  406. c:usersavkolgccx86_64-w64-mingw32includestdlib.h:208:38: note: the macro '_environ' had not yet been defined
  407. In file included from c:usersavkolgccx86_64-w64-mingw32includesec_apistdlib_s.h:9,
  408.                  from c:usersavkolgccx86_64-w64-mingw32includestdlib.h:694,
  409.                  from c:usersavkolgccincludec++10.2.0cstdlib:75,
  410.                  from c:usersavkolgccincludec++10.2.0extstring_conversions.h:41,
  411.                  from c:usersavkolgccincludec++10.2.0bitsbasic_string.h:6535,
  412.                  from c:usersavkolgccincludec++10.2.0string:55,
  413.                  from c:usersavkolgccincludec++10.2.0bitslocale_classes.h:40,
  414.                  from c:usersavkolgccincludec++10.2.0bitsios_base.h:41,
  415.                  from c:usersavkolgccincludec++10.2.0ios:42,
  416.                  from c:usersavkolgccincludec++10.2.0ostream:38,
  417.                  from c:usersavkolgccincludec++10.2.0iostream:39,
  418.                  from test.cpp:1:
  419. C:MinGWinclude/stdlib.h:203: note: it was later defined here
  420.   203 | # define _environ  (*__p__environ())
  421.       |
  422. In file included from c:usersavkolgccincludec++10.2.0cstdlib:75,
  423.                  from c:usersavkolgccincludec++10.2.0extstring_conversions.h:41,
  424.                  from c:usersavkolgccincludec++10.2.0bitsbasic_string.h:6535,
  425.                  from c:usersavkolgccincludec++10.2.0string:55,
  426.                  from c:usersavkolgccincludec++10.2.0bitslocale_classes.h:40,
  427.                  from c:usersavkolgccincludec++10.2.0bitsios_base.h:41,
  428.                  from c:usersavkolgccincludec++10.2.0ios:42,
  429.                  from c:usersavkolgccincludec++10.2.0ostream:38,
  430.                  from c:usersavkolgccincludec++10.2.0iostream:39,
  431.                  from test.cpp:1:
  432. c:usersavkolgccx86_64-w64-mingw32includestdlib.h:217:22: error: conflicting declaration 'wchar_t*** __MINGW_IMP_SYMBOL'
  433.   217 |   extern wchar_t *** __MINGW_IMP_SYMBOL(_wenviron);
  434.       |                      ^~~~~~~~~~~~~~~~~~
  435. c:usersavkolgccx86_64-w64-mingw32includestdlib.h:180:16: note: previous declaration as 'int* __MINGW_IMP_SYMBOL'
  436.   180 |   extern int * __MINGW_IMP_SYMBOL(__argc);
  437.       |                ^~~~~~~~~~~~~~~~~~
  438. c:usersavkolgccx86_64-w64-mingw32includestdlib.h:217:41: error: '_wenviron' was not declared in this scope
  439.   217 |   extern wchar_t *** __MINGW_IMP_SYMBOL(_wenviron);
  440.       |                                         ^~~~~~~~~
  441. c:usersavkolgccx86_64-w64-mingw32includestdlib.h:217:41: note: the macro '_wenviron' had not yet been defined
  442. In file included from c:usersavkolgccx86_64-w64-mingw32includesec_apistdlib_s.h:9,
  443.                  from c:usersavkolgccx86_64-w64-mingw32includestdlib.h:694,
  444.                  from c:usersavkolgccincludec++10.2.0cstdlib:75,
  445.                  from c:usersavkolgccincludec++10.2.0extstring_conversions.h:41,
  446.                  from c:usersavkolgccincludec++10.2.0bitsbasic_string.h:6535,
  447.                  from c:usersavkolgccincludec++10.2.0string:55,
  448.                  from c:usersavkolgccincludec++10.2.0bitslocale_classes.h:40,
  449.                  from c:usersavkolgccincludec++10.2.0bitsios_base.h:41,
  450.                  from c:usersavkolgccincludec++10.2.0ios:42,
  451.                  from c:usersavkolgccincludec++10.2.0ostream:38,
  452.                  from c:usersavkolgccincludec++10.2.0iostream:39,
  453.                  from test.cpp:1:
  454. C:MinGWinclude/stdlib.h:205: note: it was later defined here
  455.   205 | # define _wenviron  (*__p__wenviron())
  456.       |
  457. In file included from c:usersavkolgccincludec++10.2.0cstdlib:75,
  458.                  from c:usersavkolgccincludec++10.2.0extstring_conversions.h:41,
  459.                  from c:usersavkolgccincludec++10.2.0bitsbasic_string.h:6535,
  460.                  from c:usersavkolgccincludec++10.2.0string:55,
  461.                  from c:usersavkolgccincludec++10.2.0bitslocale_classes.h:40,
  462.                  from c:usersavkolgccincludec++10.2.0bitsios_base.h:41,
  463.                  from c:usersavkolgccincludec++10.2.0ios:42,
  464.                  from c:usersavkolgccincludec++10.2.0ostream:38,
  465.                  from c:usersavkolgccincludec++10.2.0iostream:39,
  466.                  from test.cpp:1:
  467. c:usersavkolgccx86_64-w64-mingw32includestdlib.h:226:18: error: conflicting declaration 'char** __MINGW_IMP_SYMBOL'
  468.   226 |   extern char ** __MINGW_IMP_SYMBOL(_pgmptr);
  469.       |                  ^~~~~~~~~~~~~~~~~~
  470. c:usersavkolgccx86_64-w64-mingw32includestdlib.h:180:16: note: previous declaration as 'int* __MINGW_IMP_SYMBOL'
  471.   180 |   extern int * __MINGW_IMP_SYMBOL(__argc);
  472.       |                ^~~~~~~~~~~~~~~~~~
  473. c:usersavkolgccx86_64-w64-mingw32includestdlib.h:226:37: error: '_pgmptr' was not declared in this scope
  474.   226 |   extern char ** __MINGW_IMP_SYMBOL(_pgmptr);
  475.       |                                     ^~~~~~~
  476. c:usersavkolgccx86_64-w64-mingw32includestdlib.h:226:37: note: the macro '_pgmptr' had not yet been defined
  477. In file included from c:usersavkolgccx86_64-w64-mingw32includesec_apistdlib_s.h:9,
  478.                  from c:usersavkolgccx86_64-w64-mingw32includestdlib.h:694,
  479.                  from c:usersavkolgccincludec++10.2.0cstdlib:75,
  480.                  from c:usersavkolgccincludec++10.2.0extstring_conversions.h:41,
  481.                  from c:usersavkolgccincludec++10.2.0bitsbasic_string.h:6535,
  482.                  from c:usersavkolgccincludec++10.2.0string:55,
  483.                  from c:usersavkolgccincludec++10.2.0bitslocale_classes.h:40,
  484.                  from c:usersavkolgccincludec++10.2.0bitsios_base.h:41,
  485.                  from c:usersavkolgccincludec++10.2.0ios:42,
  486.                  from c:usersavkolgccincludec++10.2.0ostream:38,
  487.                  from c:usersavkolgccincludec++10.2.0iostream:39,
  488.                  from test.cpp:1:
  489. C:MinGWinclude/stdlib.h:315: note: it was later defined here
  490.   315 | #define _pgmptr  (*__p__pgmptr())
  491.       |
  492. In file included from c:usersavkolgccincludec++10.2.0cstdlib:75,
  493.                  from c:usersavkolgccincludec++10.2.0extstring_conversions.h:41,
  494.                  from c:usersavkolgccincludec++10.2.0bitsbasic_string.h:6535,
  495.                  from c:usersavkolgccincludec++10.2.0string:55,
  496.                  from c:usersavkolgccincludec++10.2.0bitslocale_classes.h:40,
  497.                  from c:usersavkolgccincludec++10.2.0bitsios_base.h:41,
  498.                  from c:usersavkolgccincludec++10.2.0ios:42,
  499.                  from c:usersavkolgccincludec++10.2.0ostream:38,
  500.                  from c:usersavkolgccincludec++10.2.0iostream:39,
  501.                  from test.cpp:1:
  502. c:usersavkolgccx86_64-w64-mingw32includestdlib.h:235:21: error: conflicting declaration 'wchar_t** __MINGW_IMP_SYMBOL'
  503.   235 |   extern wchar_t ** __MINGW_IMP_SYMBOL(_wpgmptr);
  504.       |                     ^~~~~~~~~~~~~~~~~~
  505. c:usersavkolgccx86_64-w64-mingw32includestdlib.h:180:16: note: previous declaration as 'int* __MINGW_IMP_SYMBOL'
  506.   180 |   extern int * __MINGW_IMP_SYMBOL(__argc);
  507.       |                ^~~~~~~~~~~~~~~~~~
  508. c:usersavkolgccx86_64-w64-mingw32includestdlib.h:235:40: error: '_wpgmptr' was not declared in this scope
  509.   235 |   extern wchar_t ** __MINGW_IMP_SYMBOL(_wpgmptr);
  510.       |                                        ^~~~~~~~
  511. c:usersavkolgccx86_64-w64-mingw32includestdlib.h:235:40: note: the macro '_wpgmptr' had not yet been defined
  512. In file included from c:usersavkolgccx86_64-w64-mingw32includesec_apistdlib_s.h:9,
  513.                  from c:usersavkolgccx86_64-w64-mingw32includestdlib.h:694,
  514.                  from c:usersavkolgccincludec++10.2.0cstdlib:75,
  515.                  from c:usersavkolgccincludec++10.2.0extstring_conversions.h:41,
  516.                  from c:usersavkolgccincludec++10.2.0bitsbasic_string.h:6535,
  517.                  from c:usersavkolgccincludec++10.2.0string:55,
  518.                  from c:usersavkolgccincludec++10.2.0bitslocale_classes.h:40,
  519.                  from c:usersavkolgccincludec++10.2.0bitsios_base.h:41,
  520.                  from c:usersavkolgccincludec++10.2.0ios:42,
  521.                  from c:usersavkolgccincludec++10.2.0ostream:38,
  522.                  from c:usersavkolgccincludec++10.2.0iostream:39,
  523.                  from test.cpp:1:
  524. C:MinGWinclude/stdlib.h:318: note: it was later defined here
  525.   318 | #define _wpgmptr  (*__p__wpgmptr())
  526.       |
  527. In file included from c:usersavkolgccincludec++10.2.0cstdlib:75,
  528.                  from c:usersavkolgccincludec++10.2.0extstring_conversions.h:41,
  529.                  from c:usersavkolgccincludec++10.2.0bitsbasic_string.h:6535,
  530.                  from c:usersavkolgccincludec++10.2.0string:55,
  531.                  from c:usersavkolgccincludec++10.2.0bitslocale_classes.h:40,
  532.                  from c:usersavkolgccincludec++10.2.0bitsios_base.h:41,
  533.                  from c:usersavkolgccincludec++10.2.0ios:42,
  534.                  from c:usersavkolgccincludec++10.2.0ostream:38,
  535.                  from c:usersavkolgccincludec++10.2.0iostream:39,
  536.                  from test.cpp:1:
  537. c:usersavkolgccx86_64-w64-mingw32includestdlib.h:245:16: error: redefinition of 'int* __MINGW_IMP_SYMBOL'
  538.   245 |   extern int * __MINGW_IMP_SYMBOL(_fmode);
  539.       |                ^~~~~~~~~~~~~~~~~~
  540. c:usersavkolgccx86_64-w64-mingw32includestdlib.h:180:16: note: 'int* __MINGW_IMP_SYMBOL' previously defined here
  541.   180 |   extern int * __MINGW_IMP_SYMBOL(__argc);
  542.       |                ^~~~~~~~~~~~~~~~~~
  543. c:usersavkolgccx86_64-w64-mingw32includestdlib.h:245:35: error: '_fmode' was not declared in this scope
  544.   245 |   extern int * __MINGW_IMP_SYMBOL(_fmode);
  545.       |                                   ^~~~~~
  546. c:usersavkolgccx86_64-w64-mingw32includestdlib.h:245:35: note: the macro '_fmode' had not yet been defined
  547. c:usersavkolgccx86_64-w64-mingw32includestdlib.h:246: note: it was later defined here
  548.   246 | #define _fmode (* __MINGW_IMP_SYMBOL(_fmode))
  549.       |
  550. c:usersavkolgccx86_64-w64-mingw32includestdlib.h:256:25: error: conflicting declaration 'unsigned int* __MINGW_IMP_SYMBOL'
  551.   256 |   extern unsigned int * __MINGW_IMP_SYMBOL(_osplatform);
  552.       |                         ^~~~~~~~~~~~~~~~~~
  553. c:usersavkolgccx86_64-w64-mingw32includestdlib.h:180:16: note: previous declaration as 'int* __MINGW_IMP_SYMBOL'
  554.   180 |   extern int * __MINGW_IMP_SYMBOL(__argc);
  555.       |                ^~~~~~~~~~~~~~~~~~
  556. c:usersavkolgccx86_64-w64-mingw32includestdlib.h:256:44: error: '_osplatform' was not declared in this scope
  557.   256 |   extern unsigned int * __MINGW_IMP_SYMBOL(_osplatform);
  558.       |                                            ^~~~~~~~~~~
  559. c:usersavkolgccx86_64-w64-mingw32includestdlib.h:256:44: note: the macro '_osplatform' had not yet been defined
  560. c:usersavkolgccx86_64-w64-mingw32includestdlib.h:257: note: it was later defined here
  561.   257 | #define _osplatform (* __MINGW_IMP_SYMBOL(_osplatform))
  562.       |
  563. c:usersavkolgccx86_64-w64-mingw32includestdlib.h:265:25: error: conflicting declaration 'unsigned int* __MINGW_IMP_SYMBOL'
  564.   265 |   extern unsigned int * __MINGW_IMP_SYMBOL(_osver);
  565.       |                         ^~~~~~~~~~~~~~~~~~
  566. c:usersavkolgccx86_64-w64-mingw32includestdlib.h:180:16: note: previous declaration as 'int* __MINGW_IMP_SYMBOL'
  567.   180 |   extern int * __MINGW_IMP_SYMBOL(__argc);
  568.       |                ^~~~~~~~~~~~~~~~~~
  569. c:usersavkolgccx86_64-w64-mingw32includestdlib.h:265:44: error: '_osver' was not declared in this scope
  570.   265 |   extern unsigned int * __MINGW_IMP_SYMBOL(_osver);
  571.       |                                            ^~~~~~
  572. c:usersavkolgccx86_64-w64-mingw32includestdlib.h:265:44: note: the macro '_osver' had not yet been defined
  573. c:usersavkolgccx86_64-w64-mingw32includestdlib.h:266: note: it was later defined here
  574.   266 | #define _osver (* __MINGW_IMP_SYMBOL(_osver))
  575.       |
  576. c:usersavkolgccx86_64-w64-mingw32includestdlib.h:274:25: error: conflicting declaration 'unsigned int* __MINGW_IMP_SYMBOL'
  577.   274 |   extern unsigned int * __MINGW_IMP_SYMBOL(_winver);
  578.       |                         ^~~~~~~~~~~~~~~~~~
  579. c:usersavkolgccx86_64-w64-mingw32includestdlib.h:180:16: note: previous declaration as 'int* __MINGW_IMP_SYMBOL'
  580.   180 |   extern int * __MINGW_IMP_SYMBOL(__argc);
  581.       |                ^~~~~~~~~~~~~~~~~~
  582. c:usersavkolgccx86_64-w64-mingw32includestdlib.h:274:44: error: '_winver' was not declared in this scope
  583.   274 |   extern unsigned int * __MINGW_IMP_SYMBOL(_winver);
  584.       |                                            ^~~~~~~
  585. c:usersavkolgccx86_64-w64-mingw32includestdlib.h:274:44: note: the macro '_winver' had not yet been defined
  586. c:usersavkolgccx86_64-w64-mingw32includestdlib.h:275: note: it was later defined here
  587.   275 | #define _winver (* __MINGW_IMP_SYMBOL(_winver))
  588.       |
  589. c:usersavkolgccx86_64-w64-mingw32includestdlib.h:283:25: error: conflicting declaration 'unsigned int* __MINGW_IMP_SYMBOL'
  590.   283 |   extern unsigned int * __MINGW_IMP_SYMBOL(_winmajor);
  591.       |                         ^~~~~~~~~~~~~~~~~~
  592. c:usersavkolgccx86_64-w64-mingw32includestdlib.h:180:16: note: previous declaration as 'int* __MINGW_IMP_SYMBOL'
  593.   180 |   extern int * __MINGW_IMP_SYMBOL(__argc);
  594.       |                ^~~~~~~~~~~~~~~~~~
  595. c:usersavkolgccx86_64-w64-mingw32includestdlib.h:283:44: error: '_winmajor' was not declared in this scope
  596.   283 |   extern unsigned int * __MINGW_IMP_SYMBOL(_winmajor);
  597.       |                                            ^~~~~~~~~
  598. c:usersavkolgccx86_64-w64-mingw32includestdlib.h:283:44: note: the macro '_winmajor' had not yet been defined
  599. c:usersavkolgccx86_64-w64-mingw32includestdlib.h:284: note: it was later defined here
  600.   284 | #define _winmajor (* __MINGW_IMP_SYMBOL(_winmajor))
  601.       |
  602. c:usersavkolgccx86_64-w64-mingw32includestdlib.h:292:25: error: conflicting declaration 'unsigned int* __MINGW_IMP_SYMBOL'
  603.   292 |   extern unsigned int * __MINGW_IMP_SYMBOL(_winminor);
  604.       |                         ^~~~~~~~~~~~~~~~~~
  605. c:usersavkolgccx86_64-w64-mingw32includestdlib.h:180:16: note: previous declaration as 'int* __MINGW_IMP_SYMBOL'
  606.   180 |   extern int * __MINGW_IMP_SYMBOL(__argc);
  607.       |                ^~~~~~~~~~~~~~~~~~
  608. c:usersavkolgccx86_64-w64-mingw32includestdlib.h:292:44: error: '_winminor' was not declared in this scope
  609.   292 |   extern unsigned int * __MINGW_IMP_SYMBOL(_winminor);
  610.       |                                            ^~~~~~~~~
  611. c:usersavkolgccx86_64-w64-mingw32includestdlib.h:292:44: note: the macro '_winminor' had not yet been defined
  612. c:usersavkolgccx86_64-w64-mingw32includestdlib.h:293: note: it was later defined here
  613.   293 | #define _winminor (* __MINGW_IMP_SYMBOL(_winminor))
  614.       |
  615. c:usersavkolgccx86_64-w64-mingw32includestdlib.h:307:37: error: 'size_t' has not been declared
  616.   307 |     template <typename _CountofType,size_t _SizeOfArray> char (*__countof_helper(UNALIGNED _CountofType (&_Array)[_SizeOfArray]))[_SizeOfArray];
  617.       |                                     ^~~~~~
  618. c:usersavkolgccx86_64-w64-mingw32includestdlib.h:307:81: error: expected ')' before '(' token
  619.   307 |     template <typename _CountofType,size_t _SizeOfArray> char (*__countof_helper(UNALIGNED _CountofType (&_Array)[_SizeOfArray]))[_SizeOfArray];
  620.       |                                                               ~                 ^
  621.       |                                                                                 )
  622. In file included from c:usersavkolgccincludec++10.2.0cstdlib:75,
  623.                  from c:usersavkolgccincludec++10.2.0extstring_conversions.h:41,
  624.                  from c:usersavkolgccincludec++10.2.0bitsbasic_string.h:6535,
  625.                  from c:usersavkolgccincludec++10.2.0string:55,
  626.                  from c:usersavkolgccincludec++10.2.0bitslocale_classes.h:40,
  627.                  from c:usersavkolgccincludec++10.2.0bitsios_base.h:41,
  628.                  from c:usersavkolgccincludec++10.2.0ios:42,
  629.                  from c:usersavkolgccincludec++10.2.0ostream:38,
  630.                  from c:usersavkolgccincludec++10.2.0iostream:39,
  631.                  from test.cpp:1:
  632. c:usersavkolgccx86_64-w64-mingw32includestdlib.h:342:3: error: '__MINGW_EXTENSION' does not name a type
  633.   342 |   __MINGW_EXTENSION __int64 __cdecl _abs64(__int64);
  634.       |   ^~~~~~~~~~~~~~~~~
  635. c:usersavkolgccx86_64-w64-mingw32includestdlib.h:361:60: error: 'size_t' has not been declared
  636.   361 |   void *__cdecl bsearch(const void *_Key,const void *_Base,size_t _NumOfElements,size_t _SizeOfElements,int (__cdecl *_PtFuncCompare)(const void *,const void *));
  637.       |                                                            ^~~~~~
  638. c:usersavkolgccx86_64-w64-mingw32includestdlib.h:361:82: error: 'size_t' has not been declared
  639.   361 |   void *__cdecl bsearch(const void *_Key,const void *_Base,size_t _NumOfElements,size_t _SizeOfElements,int (__cdecl *_PtFuncCompare)(const void *,const void *));
  640.       |                                                                                  ^~~~~~
  641. c:usersavkolgccx86_64-w64-mingw32includestdlib.h:362:34: error: 'size_t' has not been declared
  642.   362 |   void __cdecl qsort(void *_Base,size_t _NumOfElements,size_t _SizeOfElements,int (__cdecl *_PtFuncCompare)(const void *,const void *));
  643.       |                                  ^~~~~~
  644. c:usersavkolgccx86_64-w64-mingw32includestdlib.h:362:56: error: 'size_t' has not been declared
  645.   362 |   void __cdecl qsort(void *_Base,size_t _NumOfElements,size_t _SizeOfElements,int (__cdecl *_PtFuncCompare)(const void *,const void *));
  646.       |                                                        ^~~~~~
  647. c:usersavkolgccx86_64-w64-mingw32includestdlib.h:366:3: error: '__MINGW_EXTENSION' does not name a type
  648.   366 |   __MINGW_EXTENSION unsigned __int64 __cdecl _byteswap_uint64(unsigned __int64 _Int64);
  649.       |   ^~~~~~~~~~~~~~~~~
  650. c:usersavkolgccx86_64-w64-mingw32includestdlib.h:368:46: error: expected initializer before '__MINGW_ATTRIB_DEPRECATED_SEC_WARN'
  651.   368 |   char *__cdecl getenv(const char *_VarName) __MINGW_ATTRIB_DEPRECATED_SEC_WARN;
  652.       |                                              ^~~~~~~~~~~~~~~~~~~~~~~~~~~~~~~~~~
  653. c:usersavkolgccx86_64-w64-mingw32includestdlib.h:370:3: error: '__MINGW_EXTENSION' does not name a type
  654.   370 |   __MINGW_EXTENSION _CRTIMP char *__cdecl _i64toa(__int64 _Val,char *_DstBuf,int _Radix) __MINGW_ATTRIB_DEPRECATED_SEC_WARN;
  655.       |   ^~~~~~~~~~~~~~~~~
  656. c:usersavkolgccx86_64-w64-mingw32includestdlib.h:371:3: error: '__MINGW_EXTENSION' does not name a type
  657.   371 |   __MINGW_EXTENSION _CRTIMP char *__cdecl _ui64toa(unsigned __int64 _Val,char *_DstBuf,int _Radix) __MINGW_ATTRIB_DEPRECATED_SEC_WARN;
  658.       |   ^~~~~~~~~~~~~~~~~
  659. c:usersavkolgccx86_64-w64-mingw32includestdlib.h:372:3: error: '__MINGW_EXTENSION' does not name a type
  660.   372 |   __MINGW_EXTENSION _CRTIMP __int64 __cdecl _atoi64(const char *_String);
  661.       |   ^~~~~~~~~~~~~~~~~
  662. c:usersavkolgccx86_64-w64-mingw32includestdlib.h:373:3: error: '__MINGW_EXTENSION' does not name a type
  663.   373 |   __MINGW_EXTENSION _CRTIMP __int64 __cdecl _atoi64_l(const char *_String,_locale_t _Locale);
  664.       |   ^~~~~~~~~~~~~~~~~
  665. c:usersavkolgccx86_64-w64-mingw32includestdlib.h:374:3: error: '__MINGW_EXTENSION' does not name a type
  666.   374 |   __MINGW_EXTENSION _CRTIMP __int64 __cdecl _strtoi64(const char *_String,char **_EndPtr,int _Radix);
  667.       |   ^~~~~~~~~~~~~~~~~
  668. c:usersavkolgccx86_64-w64-mingw32includestdlib.h:375:3: error: '__MINGW_EXTENSION' does not name a type
  669.   375 |   __MINGW_EXTENSION _CRTIMP __int64 __cdecl _strtoi64_l(const char *_String,char **_EndPtr,int _Radix,_locale_t _Locale);
  670.       |   ^~~~~~~~~~~~~~~~~
  671. c:usersavkolgccx86_64-w64-mingw32includestdlib.h:376:3: error: '__MINGW_EXTENSION' does not name a type
  672.   376 |   __MINGW_EXTENSION _CRTIMP unsigned __int64 __cdecl _strtoui64(const char *_String,char **_EndPtr,int _Radix);
  673.       |   ^~~~~~~~~~~~~~~~~
  674. c:usersavkolgccx86_64-w64-mingw32includestdlib.h:377:3: error: '__MINGW_EXTENSION' does not name a type
  675.   377 |   __MINGW_EXTENSION _CRTIMP unsigned __int64 __cdecl _strtoui64_l(const char *_String,char **_EndPtr,int _Radix,_locale_t _Locale);
  676.       |   ^~~~~~~~~~~~~~~~~
  677. c:usersavkolgccx86_64-w64-mingw32includestdlib.h:379:67: error: expected initializer before '__MINGW_ATTRIB_DEPRECATED_SEC_WARN'
  678.   379 |   _CRTIMP char *__cdecl _ltoa(long _Value,char *_Dest,int _Radix) __MINGW_ATTRIB_DEPRECATED_SEC_WARN;
  679.       |                                                                   ^~~~~~~~~~~~~~~~~~~~~~~~~~~~~~~~~~
  680. c:usersavkolgccx86_64-w64-mingw32includestdlib.h:380:37: error: 'size_t' has not been declared
  681.   380 |   int __cdecl mblen(const char *_Ch,size_t _MaxCount);
  682.       |                                     ^~~~~~
  683. c:usersavkolgccx86_64-w64-mingw32includestdlib.h:381:48: error: 'size_t' has not been declared
  684.   381 |   _CRTIMP int __cdecl _mblen_l(const char *_Ch,size_t _MaxCount,_locale_t _Locale);
  685.       |                                                ^~~~~~
  686. c:usersavkolgccx86_64-w64-mingw32includestdlib.h:382:11: error: 'size_t' does not name a type
  687.   382 |   _CRTIMP size_t __cdecl _mbstrlen(const char *_Str);
  688.       |           ^~~~~~
  689. In file included from c:usersavkolgccincludec++10.2.0cstdlib:75,
  690.                  from c:usersavkolgccincludec++10.2.0extstring_conversions.h:41,
  691.                  from c:usersavkolgccincludec++10.2.0bitsbasic_string.h:6535,
  692.                  from c:usersavkolgccincludec++10.2.0string:55,
  693.                  from c:usersavkolgccincludec++10.2.0bitslocale_classes.h:40,
  694.                  from c:usersavkolgccincludec++10.2.0bitsios_base.h:41,
  695.                  from c:usersavkolgccincludec++10.2.0ios:42,
  696.                  from c:usersavkolgccincludec++10.2.0ostream:38,
  697.                  from c:usersavkolgccincludec++10.2.0iostream:39,
  698.                  from test.cpp:1:
  699. c:usersavkolgccx86_64-w64-mingw32includestdlib.h:11:1: note: 'size_t' is defined in header '<cstddef>'; did you forget to '#include <cstddef>'?
  700.    10 | #include <limits.h>
  701.   +++ |+#include <cstddef>
  702.    11 |
  703. In file included from c:usersavkolgccincludec++10.2.0cstdlib:75,
  704.                  from c:usersavkolgccincludec++10.2.0extstring_conversions.h:41,
  705.                  from c:usersavkolgccincludec++10.2.0bitsbasic_string.h:6535,
  706.                  from c:usersavkolgccincludec++10.2.0string:55,
  707.                  from c:usersavkolgccincludec++10.2.0bitslocale_classes.h:40,
  708.                  from c:usersavkolgccincludec++10.2.0bitsios_base.h:41,
  709.                  from c:usersavkolgccincludec++10.2.0ios:42,
  710.                  from c:usersavkolgccincludec++10.2.0ostream:38,
  711.                  from c:usersavkolgccincludec++10.2.0iostream:39,
  712.                  from test.cpp:1:
  713. c:usersavkolgccx86_64-w64-mingw32includestdlib.h:383:11: error: 'size_t' does not name a type
  714.   383 |   _CRTIMP size_t __cdecl _mbstrlen_l(const char *_Str,_locale_t _Locale);
  715.       |           ^~~~~~
  716. c:usersavkolgccx86_64-w64-mingw32includestdlib.h:383:11: note: 'size_t' is defined in header '<cstddef>'; did you forget to '#include <cstddef>'?
  717. c:usersavkolgccx86_64-w64-mingw32includestdlib.h:384:11: error: 'size_t' does not name a type
  718.   384 |   _CRTIMP size_t __cdecl _mbstrnlen(const char *_Str,size_t _MaxCount);
  719.       |           ^~~~~~
  720. c:usersavkolgccx86_64-w64-mingw32includestdlib.h:384:11: note: 'size_t' is defined in header '<cstddef>'; did you forget to '#include <cstddef>'?
  721. c:usersavkolgccx86_64-w64-mingw32includestdlib.h:385:11: error: 'size_t' does not name a type
  722.   385 |   _CRTIMP size_t __cdecl _mbstrnlen_l(const char *_Str,size_t _MaxCount,_locale_t _Locale);
  723.       |           ^~~~~~
  724. c:usersavkolgccx86_64-w64-mingw32includestdlib.h:385:11: note: 'size_t' is defined in header '<cstddef>'; did you forget to '#include <cstddef>'?
  725. c:usersavkolgccx86_64-w64-mingw32includestdlib.h:386:85: error: 'size_t' has not been declared
  726.   386 |   int __cdecl mbtowc(wchar_t * __restrict__ _DstCh,const char * __restrict__ _SrcCh,size_t _SrcSizeInBytes);
  727.       |                                                                                     ^~~~~~
  728. c:usersavkolgccx86_64-w64-mingw32includestdlib.h:387:96: error: 'size_t' has not been declared
  729.   387 |   _CRTIMP int __cdecl _mbtowc_l(wchar_t * __restrict__ _DstCh,const char * __restrict__ _SrcCh,size_t _SrcSizeInBytes,_locale_t _Locale);
  730.       |                                                                                                ^~~~~~
  731. c:usersavkolgccx86_64-w64-mingw32includestdlib.h:388:3: error: 'size_t' does not name a type
  732.   388 |   size_t __cdecl mbstowcs(wchar_t * __restrict__ _Dest,const char * __restrict__ _Source,size_t _MaxCount);
  733.       |   ^~~~~~
  734. c:usersavkolgccx86_64-w64-mingw32includestdlib.h:388:3: note: 'size_t' is defined in header '<cstddef>'; did you forget to '#include <cstddef>'?
  735. c:usersavkolgccx86_64-w64-mingw32includestdlib.h:389:11: error: 'size_t' does not name a type
  736.   389 |   _CRTIMP size_t __cdecl _mbstowcs_l(wchar_t * __restrict__ _Dest,const char * __restrict__ _Source,size_t _MaxCount,_locale_t _Locale);
  737.       |           ^~~~~~
  738. c:usersavkolgccx86_64-w64-mingw32includestdlib.h:389:11: note: 'size_t' is defined in header '<cstddef>'; did you forget to '#include <cstddef>'?
  739. c:usersavkolgccx86_64-w64-mingw32includestdlib.h:404:1: error: '__mingw_ovr' does not name a type
  740.   404 | __mingw_ovr
  741.       | ^~~~~~~~~~~
  742. c:usersavkolgccx86_64-w64-mingw32includestdlib.h:411:1: error: '__mingw_ovr' does not name a type
  743.   411 | __mingw_ovr
  744.       | ^~~~~~~~~~~
  745. c:usersavkolgccx86_64-w64-mingw32includestdlib.h:447:77: error: expected initializer before '__MINGW_ATTRIB_DEPRECATED_SEC_WARN'
  746.   447 |   _CRTIMP char *__cdecl _ultoa(unsigned long _Value,char *_Dest,int _Radix) __MINGW_ATTRIB_DEPRECATED_SEC_WARN;
  747.       |                                                                             ^~~~~~~~~~~~~~~~~~~~~~~~~~~~~~~~~~
  748. c:usersavkolgccx86_64-w64-mingw32includestdlib.h:448:48: error: expected initializer before '__MINGW_ATTRIB_DEPRECATED_SEC_WARN'
  749.   448 |   int __cdecl wctomb(char *_MbCh,wchar_t _WCh) __MINGW_ATTRIB_DEPRECATED_SEC_WARN;
  750.       |                                                ^~~~~~~~~~~~~~~~~~~~~~~~~~~~~~~~~~
  751. c:usersavkolgccx86_64-w64-mingw32includestdlib.h:449:77: error: expected initializer before '__MINGW_ATTRIB_DEPRECATED_SEC_WARN'
  752.   449 |   _CRTIMP int __cdecl _wctomb_l(char *_MbCh,wchar_t _WCh,_locale_t _Locale) __MINGW_ATTRIB_DEPRECATED_SEC_WARN;
  753.       |                                                                             ^~~~~~~~~~~~~~~~~~~~~~~~~~~~~~~~~~
  754. c:usersavkolgccx86_64-w64-mingw32includestdlib.h:450:3: error: 'size_t' does not name a type
  755.   450 |   size_t __cdecl wcstombs(char * __restrict__ _Dest,const wchar_t * __restrict__ _Source,size_t _MaxCount) __MINGW_ATTRIB_DEPRECATED_SEC_WARN;
  756.       |   ^~~~~~
  757. c:usersavkolgccx86_64-w64-mingw32includestdlib.h:450:3: note: 'size_t' is defined in header '<cstddef>'; did you forget to '#include <cstddef>'?
  758. c:usersavkolgccx86_64-w64-mingw32includestdlib.h:451:11: error: 'size_t' does not name a type
  759.   451 |   _CRTIMP size_t __cdecl _wcstombs_l(char * __restrict__ _Dest,const wchar_t * __restrict__ _Source,size_t _MaxCount,_locale_t _Locale) __MINGW_ATTRIB_DEPRECATED_SEC_WARN;
  760.       |           ^~~~~~
  761. c:usersavkolgccx86_64-w64-mingw32includestdlib.h:451:11: note: 'size_t' is defined in header '<cstddef>'; did you forget to '#include <cstddef>'?
  762. c:usersavkolgccx86_64-w64-mingw32includestdlib.h:455:24: error: 'size_t' was not declared in this scope; did you mean 'std::size_t'?
  763.   455 |   void *__cdecl calloc(size_t _NumOfElements,size_t _SizeOfElements);
  764.       |                        ^~~~~~
  765.       |                        std::size_t
  766. In file included from c:usersavkolgccincludec++10.2.0iostream:38,
  767.                  from test.cpp:1:
  768. c:usersavkolgccincludec++10.2.0x86_64-w64-mingw32bitsc++config.h:260:26: note: 'std::size_t' declared here
  769.   260 |   typedef __SIZE_TYPE__  size_t;
  770.       |                          ^~~~~~
  771. In file included from c:usersavkolgccincludec++10.2.0cstdlib:75,
  772.                  from c:usersavkolgccincludec++10.2.0extstring_conversions.h:41,
  773.                  from c:usersavkolgccincludec++10.2.0bitsbasic_string.h:6535,
  774.                  from c:usersavkolgccincludec++10.2.0string:55,
  775.                  from c:usersavkolgccincludec++10.2.0bitslocale_classes.h:40,
  776.                  from c:usersavkolgccincludec++10.2.0bitsios_base.h:41,
  777.                  from c:usersavkolgccincludec++10.2.0ios:42,
  778.                  from c:usersavkolgccincludec++10.2.0ostream:38,
  779.                  from c:usersavkolgccincludec++10.2.0iostream:39,
  780.                  from test.cpp:1:
  781. c:usersavkolgccx86_64-w64-mingw32includestdlib.h:455:46: error: 'size_t' was not declared in this scope; did you mean 'std::size_t'?
  782.   455 |   void *__cdecl calloc(size_t _NumOfElements,size_t _SizeOfElements);
  783.       |                                              ^~~~~~
  784.       |                                              std::size_t
  785. In file included from c:usersavkolgccincludec++10.2.0iostream:38,
  786.                  from test.cpp:1:
  787. c:usersavkolgccincludec++10.2.0x86_64-w64-mingw32bitsc++config.h:260:26: note: 'std::size_t' declared here
  788.   260 |   typedef __SIZE_TYPE__  size_t;
  789.       |                          ^~~~~~
  790. In file included from c:usersavkolgccincludec++10.2.0cstdlib:75,
  791.                  from c:usersavkolgccincludec++10.2.0extstring_conversions.h:41,
  792.                  from c:usersavkolgccincludec++10.2.0bitsbasic_string.h:6535,
  793.                  from c:usersavkolgccincludec++10.2.0string:55,
  794.                  from c:usersavkolgccincludec++10.2.0bitslocale_classes.h:40,
  795.                  from c:usersavkolgccincludec++10.2.0bitsios_base.h:41,
  796.                  from c:usersavkolgccincludec++10.2.0ios:42,
  797.                  from c:usersavkolgccincludec++10.2.0ostream:38,
  798.                  from c:usersavkolgccincludec++10.2.0iostream:39,
  799.                  from test.cpp:1:
  800. c:usersavkolgccx86_64-w64-mingw32includestdlib.h:455:68: error: expression list treated as compound expression in initializer [-fpermissive]
  801.   455 |   void *__cdecl calloc(size_t _NumOfElements,size_t _SizeOfElements);
  802.       |                                                                    ^
  803. c:usersavkolgccx86_64-w64-mingw32includestdlib.h:457:24: error: 'size_t' was not declared in this scope; did you mean 'std::size_t'?
  804.   457 |   void *__cdecl malloc(size_t _Size);
  805.       |                        ^~~~~~
  806.       |                        std::size_t
  807. In file included from c:usersavkolgccincludec++10.2.0iostream:38,
  808.                  from test.cpp:1:
  809. c:usersavkolgccincludec++10.2.0x86_64-w64-mingw32bitsc++config.h:260:26: note: 'std::size_t' declared here
  810.   260 |   typedef __SIZE_TYPE__  size_t;
  811.       |                          ^~~~~~
  812. In file included from c:usersavkolgccincludec++10.2.0cstdlib:75,
  813.                  from c:usersavkolgccincludec++10.2.0extstring_conversions.h:41,
  814.                  from c:usersavkolgccincludec++10.2.0bitsbasic_string.h:6535,
  815.                  from c:usersavkolgccincludec++10.2.0string:55,
  816.                  from c:usersavkolgccincludec++10.2.0bitslocale_classes.h:40,
  817.                  from c:usersavkolgccincludec++10.2.0bitsios_base.h:41,
  818.                  from c:usersavkolgccincludec++10.2.0ios:42,
  819.                  from c:usersavkolgccincludec++10.2.0ostream:38,
  820.                  from c:usersavkolgccincludec++10.2.0iostream:39,
  821.                  from test.cpp:1:
  822. c:usersavkolgccx86_64-w64-mingw32includestdlib.h:458:39: error: 'size_t' has not been declared
  823.   458 |   void *__cdecl realloc(void *_Memory,size_t _NewSize);
  824.       |                                       ^~~~~~
  825. c:usersavkolgccx86_64-w64-mingw32includestdlib.h:459:49: error: 'size_t' has not been declared
  826.   459 |   _CRTIMP void *__cdecl _recalloc(void *_Memory,size_t _Count,size_t _Size);
  827.       |                                                 ^~~~~~
  828. c:usersavkolgccx86_64-w64-mingw32includestdlib.h:459:63: error: 'size_t' has not been declared
  829.   459 |   _CRTIMP void *__cdecl _recalloc(void *_Memory,size_t _Count,size_t _Size);
  830.       |                                                               ^~~~~~
  831. c:usersavkolgccx86_64-w64-mingw32includestdlib.h:467:41: error: 'size_t' was not declared in this scope; did you mean 'std::size_t'?
  832.   467 |   _CRTIMP void *__cdecl _aligned_malloc(size_t _Size,size_t _Alignment);
  833.       |                                         ^~~~~~
  834.       |                                         std::size_t
  835. In file included from c:usersavkolgccincludec++10.2.0iostream:38,
  836.                  from test.cpp:1:
  837. c:usersavkolgccincludec++10.2.0x86_64-w64-mingw32bitsc++config.h:260:26: note: 'std::size_t' declared here
  838.   260 |   typedef __SIZE_TYPE__  size_t;
  839.       |                          ^~~~~~
  840. In file included from c:usersavkolgccincludec++10.2.0cstdlib:75,
  841.                  from c:usersavkolgccincludec++10.2.0extstring_conversions.h:41,
  842.                  from c:usersavkolgccincludec++10.2.0bitsbasic_string.h:6535,
  843.                  from c:usersavkolgccincludec++10.2.0string:55,
  844.                  from c:usersavkolgccincludec++10.2.0bitslocale_classes.h:40,
  845.                  from c:usersavkolgccincludec++10.2.0bitsios_base.h:41,
  846.                  from c:usersavkolgccincludec++10.2.0ios:42,
  847.                  from c:usersavkolgccincludec++10.2.0ostream:38,
  848.                  from c:usersavkolgccincludec++10.2.0iostream:39,
  849.                  from test.cpp:1:
  850. c:usersavkolgccx86_64-w64-mingw32includestdlib.h:467:54: error: 'size_t' was not declared in this scope; did you mean 'std::size_t'?
  851.   467 |   _CRTIMP void *__cdecl _aligned_malloc(size_t _Size,size_t _Alignment);
  852.       |                                                      ^~~~~~
  853.       |                                                      std::size_t
  854. In file included from c:usersavkolgccincludec++10.2.0iostream:38,
  855.                  from test.cpp:1:
  856. c:usersavkolgccincludec++10.2.0x86_64-w64-mingw32bitsc++config.h:260:26: note: 'std::size_t' declared here
  857.   260 |   typedef __SIZE_TYPE__  size_t;
  858.       |                          ^~~~~~
  859. In file included from c:usersavkolgccincludec++10.2.0cstdlib:75,
  860.                  from c:usersavkolgccincludec++10.2.0extstring_conversions.h:41,
  861.                  from c:usersavkolgccincludec++10.2.0bitsbasic_string.h:6535,
  862.                  from c:usersavkolgccincludec++10.2.0string:55,
  863.                  from c:usersavkolgccincludec++10.2.0bitslocale_classes.h:40,
  864.                  from c:usersavkolgccincludec++10.2.0bitsios_base.h:41,
  865.                  from c:usersavkolgccincludec++10.2.0ios:42,
  866.                  from c:usersavkolgccincludec++10.2.0ostream:38,
  867.                  from c:usersavkolgccincludec++10.2.0iostream:39,
  868.                  from test.cpp:1:
  869. c:usersavkolgccx86_64-w64-mingw32includestdlib.h:467:71: error: expression list treated as compound expression in initializer [-fpermissive]
  870.   467 |   _CRTIMP void *__cdecl _aligned_malloc(size_t _Size,size_t _Alignment);
  871.       |                                                                       ^
  872. c:usersavkolgccx86_64-w64-mingw32includestdlib.h:471:48: error: 'size_t' was not declared in this scope; did you mean 'std::size_t'?
  873.   471 |   _CRTIMP void *__cdecl _aligned_offset_malloc(size_t _Size,size_t _Alignment,size_t _Offset);
  874.       |                                                ^~~~~~
  875.       |                                                std::size_t
  876. In file included from c:usersavkolgccincludec++10.2.0iostream:38,
  877.                  from test.cpp:1:
  878. c:usersavkolgccincludec++10.2.0x86_64-w64-mingw32bitsc++config.h:260:26: note: 'std::size_t' declared here
  879.   260 |   typedef __SIZE_TYPE__  size_t;
  880.       |                          ^~~~~~
  881. In file included from c:usersavkolgccincludec++10.2.0cstdlib:75,
  882.                  from c:usersavkolgccincludec++10.2.0extstring_conversions.h:41,
  883.                  from c:usersavkolgccincludec++10.2.0bitsbasic_string.h:6535,
  884.                  from c:usersavkolgccincludec++10.2.0string:55,
  885.                  from c:usersavkolgccincludec++10.2.0bitslocale_classes.h:40,
  886.                  from c:usersavkolgccincludec++10.2.0bitsios_base.h:41,
  887.                  from c:usersavkolgccincludec++10.2.0ios:42,
  888.                  from c:usersavkolgccincludec++10.2.0ostream:38,
  889.                  from c:usersavkolgccincludec++10.2.0iostream:39,
  890.                  from test.cpp:1:
  891. c:usersavkolgccx86_64-w64-mingw32includestdlib.h:471:61: error: 'size_t' was not declared in this scope; did you mean 'std::size_t'?
  892.   471 |   _CRTIMP void *__cdecl _aligned_offset_malloc(size_t _Size,size_t _Alignment,size_t _Offset);
  893.       |                                                             ^~~~~~
  894.       |                                                             std::size_t
  895. In file included from c:usersavkolgccincludec++10.2.0iostream:38,
  896.                  from test.cpp:1:
  897. c:usersavkolgccincludec++10.2.0x86_64-w64-mingw32bitsc++config.h:260:26: note: 'std::size_t' declared here
  898.   260 |   typedef __SIZE_TYPE__  size_t;
  899.       |                          ^~~~~~
  900. In file included from c:usersavkolgccincludec++10.2.0cstdlib:75,
  901.                  from c:usersavkolgccincludec++10.2.0extstring_conversions.h:41,
  902.                  from c:usersavkolgccincludec++10.2.0bitsbasic_string.h:6535,
  903.                  from c:usersavkolgccincludec++10.2.0string:55,
  904.                  from c:usersavkolgccincludec++10.2.0bitslocale_classes.h:40,
  905.                  from c:usersavkolgccincludec++10.2.0bitsios_base.h:41,
  906.                  from c:usersavkolgccincludec++10.2.0ios:42,
  907.                  from c:usersavkolgccincludec++10.2.0ostream:38,
  908.                  from c:usersavkolgccincludec++10.2.0iostream:39,
  909.                  from test.cpp:1:
  910. c:usersavkolgccx86_64-w64-mingw32includestdlib.h:471:79: error: 'size_t' was not declared in this scope; did you mean 'std::size_t'?
  911.   471 |   _CRTIMP void *__cdecl _aligned_offset_malloc(size_t _Size,size_t _Alignment,size_t _Offset);
  912.       |                                                                               ^~~~~~
  913.       |                                                                               std::size_t
  914. In file included from c:usersavkolgccincludec++10.2.0iostream:38,
  915.                  from test.cpp:1:
  916. c:usersavkolgccincludec++10.2.0x86_64-w64-mingw32bitsc++config.h:260:26: note: 'std::size_t' declared here
  917.   260 |   typedef __SIZE_TYPE__  size_t;
  918.       |                          ^~~~~~
  919. In file included from c:usersavkolgccincludec++10.2.0cstdlib:75,
  920.                  from c:usersavkolgccincludec++10.2.0extstring_conversions.h:41,
  921.                  from c:usersavkolgccincludec++10.2.0bitsbasic_string.h:6535,
  922.                  from c:usersavkolgccincludec++10.2.0string:55,
  923.                  from c:usersavkolgccincludec++10.2.0bitslocale_classes.h:40,
  924.                  from c:usersavkolgccincludec++10.2.0bitsios_base.h:41,
  925.                  from c:usersavkolgccincludec++10.2.0ios:42,
  926.                  from c:usersavkolgccincludec++10.2.0ostream:38,
  927.                  from c:usersavkolgccincludec++10.2.0iostream:39,
  928.                  from test.cpp:1:
  929. c:usersavkolgccx86_64-w64-mingw32includestdlib.h:471:93: error: expression list treated as compound expression in initializer [-fpermissive]
  930.   471 |   _CRTIMP void *__cdecl _aligned_offset_malloc(size_t _Size,size_t _Alignment,size_t _Offset);
  931.       |                                                                                             ^
  932. c:usersavkolgccx86_64-w64-mingw32includestdlib.h:472:56: error: 'size_t' has not been declared
  933.   472 |   _CRTIMP void *__cdecl _aligned_realloc(void *_Memory,size_t _Size,size_t _Alignment);
  934.       |                                                        ^~~~~~
  935. c:usersavkolgccx86_64-w64-mingw32includestdlib.h:472:69: error: 'size_t' has not been declared
  936.   472 |   _CRTIMP void *__cdecl _aligned_realloc(void *_Memory,size_t _Size,size_t _Alignment);
  937.       |                                                                     ^~~~~~
  938. c:usersavkolgccx86_64-w64-mingw32includestdlib.h:473:57: error: 'size_t' has not been declared
  939.   473 |   _CRTIMP void *__cdecl _aligned_recalloc(void *_Memory,size_t _Count,size_t _Size,size_t _Alignment);
  940.       |                                                         ^~~~~~
  941. c:usersavkolgccx86_64-w64-mingw32includestdlib.h:473:71: error: 'size_t' has not been declared
  942.   473 |   _CRTIMP void *__cdecl _aligned_recalloc(void *_Memory,size_t _Count,size_t _Size,size_t _Alignment);
  943.       |                                                                       ^~~~~~
  944. c:usersavkolgccx86_64-w64-mingw32includestdlib.h:473:84: error: 'size_t' has not been declared
  945.   473 |   _CRTIMP void *__cdecl _aligned_recalloc(void *_Memory,size_t _Count,size_t _Size,size_t _Alignment);
  946.       |                                                                                    ^~~~~~
  947. c:usersavkolgccx86_64-w64-mingw32includestdlib.h:474:63: error: 'size_t' has not been declared
  948.   474 |   _CRTIMP void *__cdecl _aligned_offset_realloc(void *_Memory,size_t _Size,size_t _Alignment,size_t _Offset);
  949.       |                                                               ^~~~~~
  950. c:usersavkolgccx86_64-w64-mingw32includestdlib.h:474:76: error: 'size_t' has not been declared
  951.   474 |   _CRTIMP void *__cdecl _aligned_offset_realloc(void *_Memory,size_t _Size,size_t _Alignment,size_t _Offset);
  952.       |                                                                            ^~~~~~
  953. c:usersavkolgccx86_64-w64-mingw32includestdlib.h:474:94: error: 'size_t' has not been declared
  954.   474 |   _CRTIMP void *__cdecl _aligned_offset_realloc(void *_Memory,size_t _Size,size_t _Alignment,size_t _Offset);
  955.       |                                                                                              ^~~~~~
  956. c:usersavkolgccx86_64-w64-mingw32includestdlib.h:475:64: error: 'size_t' has not been declared
  957.   475 |   _CRTIMP void *__cdecl _aligned_offset_recalloc(void *_Memory,size_t _Count,size_t _Size,size_t _Alignment,size_t _Offset);
  958.       |                                                                ^~~~~~
  959. c:usersavkolgccx86_64-w64-mingw32includestdlib.h:475:78: error: 'size_t' has not been declared
  960.   475 |   _CRTIMP void *__cdecl _aligned_offset_recalloc(void *_Memory,size_t _Count,size_t _Size,size_t _Alignment,size_t _Offset);
  961.       |                                                                              ^~~~~~
  962. c:usersavkolgccx86_64-w64-mingw32includestdlib.h:475:91: error: 'size_t' has not been declared
  963.   475 |   _CRTIMP void *__cdecl _aligned_offset_recalloc(void *_Memory,size_t _Count,size_t _Size,size_t _Alignment,size_t _Offset);
  964.       |                                                                                           ^~~~~~
  965. c:usersavkolgccx86_64-w64-mingw32includestdlib.h:475:109: error: 'size_t' has not been declared
  966.   475 |   _CRTIMP void *__cdecl _aligned_offset_recalloc(void *_Memory,size_t _Count,size_t _Size,size_t _Alignment,size_t _Offset);
  967.       |                                                                                                             ^~~~~~
  968. c:usersavkolgccx86_64-w64-mingw32includestdlib.h:481:72: error: expected initializer before '__MINGW_ATTRIB_DEPRECATED_SEC_WARN'
  969.   481 |   _CRTIMP wchar_t *__cdecl _itow(int _Value,wchar_t *_Dest,int _Radix) __MINGW_ATTRIB_DEPRECATED_SEC_WARN;
  970.       |                                                                        ^~~~~~~~~~~~~~~~~~~~~~~~~~~~~~~~~~
  971. c:usersavkolgccx86_64-w64-mingw32includestdlib.h:482:73: error: expected initializer before '__MINGW_ATTRIB_DEPRECATED_SEC_WARN'
  972.   482 |   _CRTIMP wchar_t *__cdecl _ltow(long _Value,wchar_t *_Dest,int _Radix) __MINGW_ATTRIB_DEPRECATED_SEC_WARN;
  973.       |                                                                         ^~~~~~~~~~~~~~~~~~~~~~~~~~~~~~~~~~
  974. c:usersavkolgccx86_64-w64-mingw32includestdlib.h:483:83: error: expected initializer before '__MINGW_ATTRIB_DEPRECATED_SEC_WARN'
  975.   483 |   _CRTIMP wchar_t *__cdecl _ultow(unsigned long _Value,wchar_t *_Dest,int _Radix) __MINGW_ATTRIB_DEPRECATED_SEC_WARN;
  976.       |                                                                                   ^~~~~~~~~~~~~~~~~~~~~~~~~~~~~~~~~~
  977. c:usersavkolgccx86_64-w64-mingw32includestdlib.h:490:3: error: '__mingw_ovr' does not name a type; did you mean '__mingw_strtod'?
  978.   490 |   __mingw_ovr
  979.       |   ^~~~~~~~~~~
  980.       |   __mingw_strtod
  981. c:usersavkolgccx86_64-w64-mingw32includestdlib.h:494:3: error: '__mingw_ovr' does not name a type; did you mean '__mingw_strtod'?
  982.   494 |   __mingw_ovr
  983.       |   ^~~~~~~~~~~
  984.       |   __mingw_strtod
  985. c:usersavkolgccx86_64-w64-mingw32includestdlib.h:511:62: error: expected initializer before '__MINGW_ATTRIB_DEPRECATED_SEC_WARN'
  986.   511 |   _CRTIMP wchar_t *__cdecl _wgetenv(const wchar_t *_VarName) __MINGW_ATTRIB_DEPRECATED_SEC_WARN;
  987.       |                                                              ^~~~~~~~~~~~~~~~~~~~~~~~~~~~~~~~~~
  988. c:usersavkolgccx86_64-w64-mingw32includestdlib.h:523:3: error: '__MINGW_EXTENSION' does not name a type
  989.   523 |   __MINGW_EXTENSION _CRTIMP wchar_t *__cdecl _i64tow(__int64 _Val,wchar_t *_DstBuf,int _Radix) __MINGW_ATTRIB_DEPRECATED_SEC_WARN;
  990.       |   ^~~~~~~~~~~~~~~~~
  991. c:usersavkolgccx86_64-w64-mingw32includestdlib.h:524:3: error: '__MINGW_EXTENSION' does not name a type
  992.   524 |   __MINGW_EXTENSION _CRTIMP wchar_t *__cdecl _ui64tow(unsigned __int64 _Val,wchar_t *_DstBuf,int _Radix) __MINGW_ATTRIB_DEPRECATED_SEC_WARN;
  993.       |   ^~~~~~~~~~~~~~~~~
  994. c:usersavkolgccx86_64-w64-mingw32includestdlib.h:525:3: error: '__MINGW_EXTENSION' does not name a type
  995.   525 |   __MINGW_EXTENSION _CRTIMP __int64 __cdecl _wtoi64(const wchar_t *_Str);
  996.       |   ^~~~~~~~~~~~~~~~~
  997. c:usersavkolgccx86_64-w64-mingw32includestdlib.h:526:3: error: '__MINGW_EXTENSION' does not name a type
  998.   526 |   __MINGW_EXTENSION _CRTIMP __int64 __cdecl _wtoi64_l(const wchar_t *_Str,_locale_t _Locale);
  999.       |   ^~~~~~~~~~~~~~~~~
  1000. c:usersavkolgccx86_64-w64-mingw32includestdlib.h:527:3: error: '__MINGW_EXTENSION' does not name a type
  1001.   527 |   __MINGW_EXTENSION _CRTIMP __int64 __cdecl _wcstoi64(const wchar_t *_Str,wchar_t **_EndPtr,int _Radix);
  1002.       |   ^~~~~~~~~~~~~~~~~
  1003. c:usersavkolgccx86_64-w64-mingw32includestdlib.h:528:3: error: '__MINGW_EXTENSION' does not name a type
  1004.   528 |   __MINGW_EXTENSION _CRTIMP __int64 __cdecl _wcstoi64_l(const wchar_t *_Str,wchar_t **_EndPtr,int _Radix,_locale_t _Locale);
  1005.       |   ^~~~~~~~~~~~~~~~~
  1006. c:usersavkolgccx86_64-w64-mingw32includestdlib.h:529:3: error: '__MINGW_EXTENSION' does not name a type
  1007.   529 |   __MINGW_EXTENSION _CRTIMP unsigned __int64 __cdecl _wcstoui64(const wchar_t *_Str,wchar_t **_EndPtr,int _Radix);
  1008.       |   ^~~~~~~~~~~~~~~~~
  1009. c:usersavkolgccx86_64-w64-mingw32includestdlib.h:530:3: error: '__MINGW_EXTENSION' does not name a type
  1010.   530 |   __MINGW_EXTENSION _CRTIMP unsigned __int64 __cdecl _wcstoui64_l(const wchar_t *_Str ,wchar_t **_EndPtr,int _Radix,_locale_t _Locale);
  1011.       |   ^~~~~~~~~~~~~~~~~
  1012. c:usersavkolgccx86_64-w64-mingw32includestdlib.h:538:69: error: 'size_t' has not been declared
  1013.   538 |   _CRTIMP char *__cdecl _fullpath(char *_FullPath,const char *_Path,size_t _SizeInBytes);
  1014.       |                                                                     ^~~~~~
  1015. c:usersavkolgccx86_64-w64-mingw32includestdlib.h:539:86: error: expected initializer before '__MINGW_ATTRIB_DEPRECATED_SEC_WARN'
  1016.   539 |   _CRTIMP char *__cdecl _ecvt(double _Val,int _NumOfDigits,int *_PtDec,int *_PtSign) __MINGW_ATTRIB_DEPRECATED_SEC_WARN;
  1017.       |                                                                                      ^~~~~~~~~~~~~~~~~~~~~~~~~~~~~~~~~~
  1018. c:usersavkolgccx86_64-w64-mingw32includestdlib.h:540:83: error: expected initializer before '__MINGW_ATTRIB_DEPRECATED_SEC_WARN'
  1019.   540 |   _CRTIMP char *__cdecl _fcvt(double _Val,int _NumOfDec,int *_PtDec,int *_PtSign) __MINGW_ATTRIB_DEPRECATED_SEC_WARN;
  1020.       |                                                                                   ^~~~~~~~~~~~~~~~~~~~~~~~~~~~~~~~~~
  1021. c:usersavkolgccx86_64-w64-mingw32includestdlib.h:541:75: error: expected initializer before '__MINGW_ATTRIB_DEPRECATED_SEC_WARN'
  1022.   541 |   _CRTIMP char *__cdecl _gcvt(double _Val,int _NumOfDigits,char *_DstBuf) __MINGW_ATTRIB_DEPRECATED_SEC_WARN;
  1023.       |                                                                           ^~~~~~~~~~~~~~~~~~~~~~~~~~~~~~~~~~
  1024. c:usersavkolgccx86_64-w64-mingw32includestdlib.h:581:3: error: '__MINGW_EXTENSION' does not name a type
  1025.   581 |   __MINGW_EXTENSION unsigned __int64 __cdecl _rotl64(unsigned __int64 _Val,int _Shift);
  1026.       |   ^~~~~~~~~~~~~~~~~
  1027. c:usersavkolgccx86_64-w64-mingw32includestdlib.h:582:3: error: '__MINGW_EXTENSION' does not name a type
  1028.   582 |   __MINGW_EXTENSION unsigned __int64 __cdecl _rotr64(unsigned __int64 Value,int Shift);
  1029.       |   ^~~~~~~~~~~~~~~~~
  1030. c:usersavkolgccx86_64-w64-mingw32includestdlib.h:593:3: error: '__MINGW_EXTENSION' does not name a type
  1031.   593 |   __MINGW_EXTENSION unsigned __int64 __cdecl _rotr64(unsigned __int64 _Val,int _Shift);
  1032.       |   ^~~~~~~~~~~~~~~~~
  1033. c:usersavkolgccx86_64-w64-mingw32includestdlib.h:594:96: error: expected initializer before '__MINGW_ATTRIB_DEPRECATED_SEC_WARN'
  1034.   594 |   _CRTIMP void __cdecl _searchenv(const char *_Filename,const char *_EnvVar,char *_ResultPath) __MINGW_ATTRIB_DEPRECATED_SEC_WARN;
  1035.       |                                                                                                ^~~~~~~~~~~~~~~~~~~~~~~~~~~~~~~~~~
  1036. c:usersavkolgccx86_64-w64-mingw32includestdlib.h:595:109: error: expected initializer before '__MINGW_ATTRIB_DEPRECATED_SEC_WARN'
  1037.   595 |   _CRTIMP void __cdecl _splitpath(const char *_FullPath,char *_Drive,char *_Dir,char *_Filename,char *_Ext) __MINGW_ATTRIB_DEPRECATED_SEC_WARN;
  1038.       |                                                                                                             ^~~~~~~~~~~~~~~~~~~~~~~~~~~~~~~~~~
  1039. c:usersavkolgccx86_64-w64-mingw32includestdlib.h:600:79: error: 'size_t' has not been declared
  1040.   600 |   _CRTIMP wchar_t *__cdecl _wfullpath(wchar_t *_FullPath,const wchar_t *_Path,size_t _SizeInWords);
  1041.       |                                                                               ^~~~~~
  1042. c:usersavkolgccx86_64-w64-mingw32includestdlib.h:606:106: error: expected initializer before '__MINGW_ATTRIB_DEPRECATED_SEC_WARN'
  1043.   606 |   _CRTIMP void __cdecl _wsearchenv(const wchar_t *_Filename,const wchar_t *_EnvVar,wchar_t *_ResultPath) __MINGW_ATTRIB_DEPRECATED_SEC_WARN;
  1044.       |                                                                                                          ^~~~~~~~~~~~~~~~~~~~~~~~~~~~~~~~~~
  1045. c:usersavkolgccx86_64-w64-mingw32includestdlib.h:607:125: error: expected initializer before '__MINGW_ATTRIB_DEPRECATED_SEC_WARN'
  1046.   607 |   _CRTIMP void __cdecl _wsplitpath(const wchar_t *_FullPath,wchar_t *_Drive,wchar_t *_Dir,wchar_t *_Filename,wchar_t *_Ext) __MINGW_ATTRIB_DEPRECATED_SEC_WARN;
  1047.       |                                                                                                                             ^~~~~~~~~~~~~~~~~~~~~~~~~~~~~~~~~~
  1048. c:usersavkolgccx86_64-w64-mingw32includestdlib.h:634:77: error: expected initializer before '__MINGW_ATTRIB_DEPRECATED_MSVC2005'
  1049.   634 |   char *__cdecl ecvt(double _Val,int _NumOfDigits,int *_PtDec,int *_PtSign) __MINGW_ATTRIB_DEPRECATED_MSVC2005;
  1050.       |                                                                             ^~~~~~~~~~~~~~~~~~~~~~~~~~~~~~~~~~
  1051. c:usersavkolgccx86_64-w64-mingw32includestdlib.h:635:74: error: expected initializer before '__MINGW_ATTRIB_DEPRECATED_MSVC2005'
  1052.   635 |   char *__cdecl fcvt(double _Val,int _NumOfDec,int *_PtDec,int *_PtSign) __MINGW_ATTRIB_DEPRECATED_MSVC2005;
  1053.       |                                                                          ^~~~~~~~~~~~~~~~~~~~~~~~~~~~~~~~~~
  1054. c:usersavkolgccx86_64-w64-mingw32includestdlib.h:636:66: error: expected initializer before '__MINGW_ATTRIB_DEPRECATED_MSVC2005'
  1055.   636 |   char *__cdecl gcvt(double _Val,int _NumOfDigits,char *_DstBuf) __MINGW_ATTRIB_DEPRECATED_MSVC2005;
  1056.       |                                                                  ^~~~~~~~~~~~~~~~~~~~~~~~~~~~~~~~~~
  1057. c:usersavkolgccx86_64-w64-mingw32includestdlib.h:637:57: error: expected initializer before '__MINGW_ATTRIB_DEPRECATED_MSVC2005'
  1058.   637 |   char *__cdecl itoa(int _Val,char *_DstBuf,int _Radix) __MINGW_ATTRIB_DEPRECATED_MSVC2005;
  1059.       |                                                         ^~~~~~~~~~~~~~~~~~~~~~~~~~~~~~~~~~
  1060. c:usersavkolgccx86_64-w64-mingw32includestdlib.h:638:58: error: expected initializer before '__MINGW_ATTRIB_DEPRECATED_MSVC2005'
  1061.   638 |   char *__cdecl ltoa(long _Val,char *_DstBuf,int _Radix) __MINGW_ATTRIB_DEPRECATED_MSVC2005;
  1062.       |                                                          ^~~~~~~~~~~~~~~~~~~~~~~~~~~~~~~~~~
  1063. c:usersavkolgccx86_64-w64-mingw32includestdlib.h:639:46: error: expected initializer before '__MINGW_ATTRIB_DEPRECATED_MSVC2005'
  1064.   639 |   int __cdecl putenv(const char *_EnvString) __MINGW_ATTRIB_DEPRECATED_MSVC2005;
  1065.       |                                              ^~~~~~~~~~~~~~~~~~~~~~~~~~~~~~~~~~
  1066. c:usersavkolgccx86_64-w64-mingw32includestdlib.h:643:63: error: expected initializer before '__MINGW_ATTRIB_DEPRECATED_MSVC2005'
  1067.   643 |   void __cdecl swab(char *_Buf1,char *_Buf2,int _SizeInBytes) __MINGW_ATTRIB_DEPRECATED_MSVC2005;
  1068.       |                                                               ^~~~~~~~~~~~~~~~~~~~~~~~~~~~~~~~~~
  1069. c:usersavkolgccx86_64-w64-mingw32includestdlib.h:646:68: error: expected initializer before '__MINGW_ATTRIB_DEPRECATED_MSVC2005'
  1070.   646 |   char *__cdecl ultoa(unsigned long _Val,char *_Dstbuf,int _Radix) __MINGW_ATTRIB_DEPRECATED_MSVC2005;
  1071.       |                                                                    ^~~~~~~~~~~~~~~~~~~~~~~~~~~~~~~~~~
  1072. c:usersavkolgccx86_64-w64-mingw32includestdlib.h:653:20: error: '__MINGW_EXTENSION' does not name a type
  1073.   653 |   typedef struct { __MINGW_EXTENSION long long quot, rem; } lldiv_t;
  1074.       |                    ^~~~~~~~~~~~~~~~~
  1075. c:usersavkolgccx86_64-w64-mingw32includestdlib.h:655:3: error: '__MINGW_EXTENSION' does not name a type
  1076.   655 |   __MINGW_EXTENSION lldiv_t __cdecl lldiv(long long, long long);
  1077.       |   ^~~~~~~~~~~~~~~~~
  1078. c:usersavkolgccx86_64-w64-mingw32includestdlib.h:657:3: error: '__MINGW_EXTENSION' does not name a type
  1079.   657 |   __MINGW_EXTENSION long long __cdecl llabs(long long);
  1080.       |   ^~~~~~~~~~~~~~~~~
  1081. c:usersavkolgccx86_64-w64-mingw32includestdlib.h:659:3: error: '__MINGW_EXTENSION' does not name a type
  1082.   659 |   __MINGW_EXTENSION __CRT_INLINE long long __cdecl llabs(long long _j) { return (_j >= 0 ? _j : -_j); }
  1083.       |   ^~~~~~~~~~~~~~~~~
  1084. c:usersavkolgccx86_64-w64-mingw32includestdlib.h:662:3: error: '__MINGW_EXTENSION' does not name a type
  1085.   662 |   __MINGW_EXTENSION long long  __cdecl strtoll(const char * __restrict__, char ** __restrict, int);
  1086.       |   ^~~~~~~~~~~~~~~~~
  1087. c:usersavkolgccx86_64-w64-mingw32includestdlib.h:663:3: error: '__MINGW_EXTENSION' does not name a type
  1088.   663 |   __MINGW_EXTENSION unsigned long long  __cdecl strtoull(const char * __restrict__, char ** __restrict__, int);
  1089.       |   ^~~~~~~~~~~~~~~~~
  1090. c:usersavkolgccx86_64-w64-mingw32includestdlib.h:666:3: error: '__MINGW_EXTENSION' does not name a type
  1091.   666 |   __MINGW_EXTENSION long long  __cdecl atoll (const char *);
  1092.       |   ^~~~~~~~~~~~~~~~~
  1093. c:usersavkolgccx86_64-w64-mingw32includestdlib.h:669:3: error: '__MINGW_EXTENSION' does not name a type
  1094.   669 |   __MINGW_EXTENSION long long  __cdecl wtoll (const wchar_t *);
  1095.       |   ^~~~~~~~~~~~~~~~~
  1096. c:usersavkolgccx86_64-w64-mingw32includestdlib.h:670:3: error: '__MINGW_EXTENSION' does not name a type
  1097.   670 |   __MINGW_EXTENSION char *__cdecl lltoa (long long, char *, int);
  1098.       |   ^~~~~~~~~~~~~~~~~
  1099. c:usersavkolgccx86_64-w64-mingw32includestdlib.h:671:3: error: '__MINGW_EXTENSION' does not name a type
  1100.   671 |   __MINGW_EXTENSION char *__cdecl ulltoa (unsigned long long , char *, int);
  1101.       |   ^~~~~~~~~~~~~~~~~
  1102. c:usersavkolgccx86_64-w64-mingw32includestdlib.h:672:3: error: '__MINGW_EXTENSION' does not name a type
  1103.   672 |   __MINGW_EXTENSION wchar_t *__cdecl lltow (long long, wchar_t *, int);
  1104.       |   ^~~~~~~~~~~~~~~~~
  1105. c:usersavkolgccx86_64-w64-mingw32includestdlib.h:673:3: error: '__MINGW_EXTENSION' does not name a type
  1106.   673 |   __MINGW_EXTENSION wchar_t *__cdecl ulltow (unsigned long long, wchar_t *, int);
  1107.       |   ^~~~~~~~~~~~~~~~~
  1108. c:usersavkolgccx86_64-w64-mingw32includestdlib.h:677:3: error: '__MINGW_EXTENSION' does not name a type
  1109.   677 |   __MINGW_EXTENSION __CRT_INLINE long long  __cdecl atoll (const char * _c) { return _atoi64 (_c); }
  1110.       |   ^~~~~~~~~~~~~~~~~
  1111. c:usersavkolgccx86_64-w64-mingw32includestdlib.h:678:3: error: '__MINGW_EXTENSION' does not name a type
  1112.   678 |   __MINGW_EXTENSION __CRT_INLINE char *__cdecl lltoa (long long _n, char * _c, int _i) { return _i64toa (_n, _c, _i); }
  1113.       |   ^~~~~~~~~~~~~~~~~
  1114. c:usersavkolgccx86_64-w64-mingw32includestdlib.h:679:3: error: '__MINGW_EXTENSION' does not name a type
  1115.   679 |   __MINGW_EXTENSION __CRT_INLINE char *__cdecl ulltoa (unsigned long long _n, char * _c, int _i) { return _ui64toa (_n, _c, _i); }
  1116.       |   ^~~~~~~~~~~~~~~~~
  1117. c:usersavkolgccx86_64-w64-mingw32includestdlib.h:680:3: error: '__MINGW_EXTENSION' does not name a type
  1118.   680 |   __MINGW_EXTENSION __CRT_INLINE long long  __cdecl wtoll (const wchar_t * _w) { return _wtoi64 (_w); }
  1119.       |   ^~~~~~~~~~~~~~~~~
  1120. c:usersavkolgccx86_64-w64-mingw32includestdlib.h:681:3: error: '__MINGW_EXTENSION' does not name a type
  1121.   681 |   __MINGW_EXTENSION __CRT_INLINE wchar_t *__cdecl lltow (long long _n, wchar_t * _w, int _i) { return _i64tow (_n, _w, _i); }
  1122.       |   ^~~~~~~~~~~~~~~~~
  1123. c:usersavkolgccx86_64-w64-mingw32includestdlib.h:682:3: error: '__MINGW_EXTENSION' does not name a type
  1124.   682 |   __MINGW_EXTENSION __CRT_INLINE wchar_t *__cdecl ulltow (unsigned long long _n, wchar_t * _w, int _i) { return _ui64tow (_n, _w, _i); }
  1125.       |   ^~~~~~~~~~~~~~~~~
  1126. In file included from c:usersavkolgccx86_64-w64-mingw32includesec_apistdlib_s.h:9,
  1127.                  from c:usersavkolgccx86_64-w64-mingw32includestdlib.h:694,
  1128.                  from c:usersavkolgccincludec++10.2.0cstdlib:75,
  1129.                  from c:usersavkolgccincludec++10.2.0extstring_conversions.h:41,
  1130.                  from c:usersavkolgccincludec++10.2.0bitsbasic_string.h:6535,
  1131.                  from c:usersavkolgccincludec++10.2.0string:55,
  1132.                  from c:usersavkolgccincludec++10.2.0bitslocale_classes.h:40,
  1133.                  from c:usersavkolgccincludec++10.2.0bitsios_base.h:41,
  1134.                  from c:usersavkolgccincludec++10.2.0ios:42,
  1135.                  from c:usersavkolgccincludec++10.2.0ostream:38,
  1136.                  from c:usersavkolgccincludec++10.2.0iostream:39,
  1137.                  from test.cpp:1:
  1138. C:MinGWinclude/stdlib.h:196:39: error: conflicting declaration of C function 'int* __doserrno()'
  1139.   196 | _CRTIMP __cdecl __MINGW_NOTHROW  int *__doserrno(void);
  1140.       |                                       ^~~~~~~~~~
  1141. In file included from c:usersavkolgccincludec++10.2.0cstdlib:75,
  1142.                  from c:usersavkolgccincludec++10.2.0extstring_conversions.h:41,
  1143.                  from c:usersavkolgccincludec++10.2.0bitsbasic_string.h:6535,
  1144.                  from c:usersavkolgccincludec++10.2.0string:55,
  1145.                  from c:usersavkolgccincludec++10.2.0bitslocale_classes.h:40,
  1146.                  from c:usersavkolgccincludec++10.2.0bitsios_base.h:41,
  1147.                  from c:usersavkolgccincludec++10.2.0ios:42,
  1148.                  from c:usersavkolgccincludec++10.2.0ostream:38,
  1149.                  from c:usersavkolgccincludec++10.2.0iostream:39,
  1150.                  from test.cpp:1:
  1151. c:usersavkolgccx86_64-w64-mingw32includestdlib.h:156:34: note: previous declaration 'long unsigned int* __doserrno()'
  1152.   156 |   _CRTIMP unsigned long *__cdecl __doserrno(void);
  1153.       |                                  ^~~~~~~~~~
  1154. C:MinGWinclude/stdlib.h:277:30: error: expected ')' before '(' token
  1155.   277 | __MINGW_IMPORT  unsigned int _osver;
  1156.       |                              ^~~~~~
  1157. C:MinGWinclude/stdlib.h:278:30: error: expected ')' before '(' token
  1158.   278 | __MINGW_IMPORT  unsigned int _winver;
  1159.       |                              ^~~~~~~
  1160. C:MinGWinclude/stdlib.h:279:30: error: expected ')' before '(' token
  1161.   279 | __MINGW_IMPORT  unsigned int _winmajor;
  1162.       |                              ^~~~~~~~~
  1163. C:MinGWinclude/stdlib.h:280:30: error: expected ')' before '(' token
  1164.   280 | __MINGW_IMPORT  unsigned int _winminor;
  1165.       |                              ^~~~~~~~~
  1166. C:MinGWinclude/stdlib.h:352:21: error: expected ')' before '(' token
  1167.   352 | __MINGW_IMPORT  int _fmode;
  1168.       |                     ^~~~~~
  1169. In file included from c:usersavkolgccx86_64-w64-mingw32includesec_apistdlib_s.h:9,
  1170.                  from c:usersavkolgccx86_64-w64-mingw32includestdlib.h:694,
  1171.                  from c:usersavkolgccincludec++10.2.0cstdlib:75,
  1172.                  from c:usersavkolgccincludec++10.2.0extstring_conversions.h:41,
  1173.                  from c:usersavkolgccincludec++10.2.0bitsbasic_string.h:6535,
  1174.                  from c:usersavkolgccincludec++10.2.0string:55,
  1175.                  from c:usersavkolgccincludec++10.2.0bitslocale_classes.h:40,
  1176.                  from c:usersavkolgccincludec++10.2.0bitsios_base.h:41,
  1177.                  from c:usersavkolgccincludec++10.2.0ios:42,
  1178.                  from c:usersavkolgccincludec++10.2.0ostream:38,
  1179.                  from c:usersavkolgccincludec++10.2.0iostream:39,
  1180.                  from test.cpp:1:
  1181. C:MinGWinclude/stdlib.h:515:34: error: 'size_t' does not name a type
  1182.   515 | _CRTIMP __cdecl __MINGW_NOTHROW  size_t wcstombs (char *, const wchar_t *, size_t);
  1183.       |                                  ^~~~~~
  1184. C:MinGWinclude/stdlib.h:181:1: note: 'size_t' is defined in header '<cstddef>'; did you forget to '#include <cstddef>'?
  1185.   180 | #include "errno.h"
  1186.   +++ |+#include <cstddef>
  1187.   181 |
  1188. C:MinGWinclude/stdlib.h:518:59: error: 'size_t' has not been declared
  1189.   518 | _CRTIMP __cdecl __MINGW_NOTHROW  int mblen (const char *, size_t);
  1190.       |                                                           ^~~~~~
  1191. C:MinGWinclude/stdlib.h:519:34: error: 'size_t' does not name a type
  1192.   519 | _CRTIMP __cdecl __MINGW_NOTHROW  size_t mbstowcs (wchar_t *, const char *, size_t);
  1193.       |                                  ^~~~~~
  1194. C:MinGWinclude/stdlib.h:519:34: note: 'size_t' is defined in header '<cstddef>'; did you forget to '#include <cstddef>'?
  1195. C:MinGWinclude/stdlib.h:520:71: error: 'size_t' has not been declared
  1196.   520 | _CRTIMP __cdecl __MINGW_NOTHROW  int mbtowc (wchar_t *, const char *, size_t);
  1197.       |                                                                       ^~~~~~
  1198. In file included from C:MinGWinclude/stdlib.h:559,
  1199.                  from c:usersavkolgccx86_64-w64-mingw32includesec_apistdlib_s.h:9,
  1200.                  from c:usersavkolgccx86_64-w64-mingw32includestdlib.h:694,
  1201.                  from c:usersavkolgccincludec++10.2.0cstdlib:75,
  1202.                  from c:usersavkolgccincludec++10.2.0extstring_conversions.h:41,
  1203.                  from c:usersavkolgccincludec++10.2.0bitsbasic_string.h:6535,
  1204.                  from c:usersavkolgccincludec++10.2.0string:55,
  1205.                  from c:usersavkolgccincludec++10.2.0bitslocale_classes.h:40,
  1206.                  from c:usersavkolgccincludec++10.2.0bitsios_base.h:41,
  1207.                  from c:usersavkolgccincludec++10.2.0ios:42,
  1208.                  from c:usersavkolgccincludec++10.2.0ostream:38,
  1209.                  from c:usersavkolgccincludec++10.2.0iostream:39,
  1210.                  from test.cpp:1:
  1211. C:MinGWinclude/alloca.h:80:15: error: 'size_t' was not declared in this scope; did you mean 'std::size_t'?
  1212.    80 | void *alloca( size_t );
  1213.       |               ^~~~~~
  1214.       |               std::size_t
  1215. In file included from c:usersavkolgccincludec++10.2.0iostream:38,
  1216.                  from test.cpp:1:
  1217. c:usersavkolgccincludec++10.2.0x86_64-w64-mingw32bitsc++config.h:260:26: note: 'std::size_t' declared here
  1218.   260 |   typedef __SIZE_TYPE__  size_t;
  1219.       |                          ^~~~~~
  1220. In file included from C:MinGWinclude/stdlib.h:559,
  1221.                  from c:usersavkolgccx86_64-w64-mingw32includesec_apistdlib_s.h:9,
  1222.                  from c:usersavkolgccx86_64-w64-mingw32includestdlib.h:694,
  1223.                  from c:usersavkolgccincludec++10.2.0cstdlib:75,
  1224.                  from c:usersavkolgccincludec++10.2.0extstring_conversions.h:41,
  1225.                  from c:usersavkolgccincludec++10.2.0bitsbasic_string.h:6535,
  1226.                  from c:usersavkolgccincludec++10.2.0string:55,
  1227.                  from c:usersavkolgccincludec++10.2.0bitslocale_classes.h:40,
  1228.                  from c:usersavkolgccincludec++10.2.0bitsios_base.h:41,
  1229.                  from c:usersavkolgccincludec++10.2.0ios:42,
  1230.                  from c:usersavkolgccincludec++10.2.0ostream:38,
  1231.                  from c:usersavkolgccincludec++10.2.0iostream:39,
  1232.                  from test.cpp:1:
  1233. C:MinGWinclude/alloca.h:88:16: error: 'size_t' was not declared in this scope; did you mean 'std::size_t'?
  1234.    88 | void *_alloca( size_t );
  1235.       |                ^~~~~~
  1236.       |                std::size_t
  1237. In file included from c:usersavkolgccincludec++10.2.0iostream:38,
  1238.                  from test.cpp:1:
  1239. c:usersavkolgccincludec++10.2.0x86_64-w64-mingw32bitsc++config.h:260:26: note: 'std::size_t' declared here
  1240.   260 |   typedef __SIZE_TYPE__  size_t;
  1241.       |                          ^~~~~~
  1242. In file included from c:usersavkolgccx86_64-w64-mingw32includesec_apistdlib_s.h:9,
  1243.                  from c:usersavkolgccx86_64-w64-mingw32includestdlib.h:694,
  1244.                  from c:usersavkolgccincludec++10.2.0cstdlib:75,
  1245.                  from c:usersavkolgccincludec++10.2.0extstring_conversions.h:41,
  1246.                  from c:usersavkolgccincludec++10.2.0bitsbasic_string.h:6535,
  1247.                  from c:usersavkolgccincludec++10.2.0string:55,
  1248.                  from c:usersavkolgccincludec++10.2.0bitslocale_classes.h:40,
  1249.                  from c:usersavkolgccincludec++10.2.0bitsios_base.h:41,
  1250.                  from c:usersavkolgccincludec++10.2.0ios:42,
  1251.                  from c:usersavkolgccincludec++10.2.0ostream:38,
  1252.                  from c:usersavkolgccincludec++10.2.0iostream:39,
  1253.                  from test.cpp:1:
  1254. C:MinGWinclude/stdlib.h:562:40: error: redefinition of 'void* calloc'
  1255.   562 | _CRTIMP __cdecl __MINGW_NOTHROW  void *calloc (size_t, size_t) __MINGW_ATTRIB_MALLOC;
  1256.       |                                        ^~~~~~
  1257. In file included from c:usersavkolgccincludec++10.2.0cstdlib:75,
  1258.                  from c:usersavkolgccincludec++10.2.0extstring_conversions.h:41,
  1259.                  from c:usersavkolgccincludec++10.2.0bitsbasic_string.h:6535,
  1260.                  from c:usersavkolgccincludec++10.2.0string:55,
  1261.                  from c:usersavkolgccincludec++10.2.0bitslocale_classes.h:40,
  1262.                  from c:usersavkolgccincludec++10.2.0bitsios_base.h:41,
  1263.                  from c:usersavkolgccincludec++10.2.0ios:42,
  1264.                  from c:usersavkolgccincludec++10.2.0ostream:38,
  1265.                  from c:usersavkolgccincludec++10.2.0iostream:39,
  1266.                  from test.cpp:1:
  1267. c:usersavkolgccx86_64-w64-mingw32includestdlib.h:455:17: note: 'void* calloc' previously defined here
  1268.   455 |   void *__cdecl calloc(size_t _NumOfElements,size_t _SizeOfElements);
  1269.       |                 ^~~~~~
  1270. In file included from c:usersavkolgccx86_64-w64-mingw32includesec_apistdlib_s.h:9,
  1271.                  from c:usersavkolgccx86_64-w64-mingw32includestdlib.h:694,
  1272.                  from c:usersavkolgccincludec++10.2.0cstdlib:75,
  1273.                  from c:usersavkolgccincludec++10.2.0extstring_conversions.h:41,
  1274.                  from c:usersavkolgccincludec++10.2.0bitsbasic_string.h:6535,
  1275.                  from c:usersavkolgccincludec++10.2.0string:55,
  1276.                  from c:usersavkolgccincludec++10.2.0bitslocale_classes.h:40,
  1277.                  from c:usersavkolgccincludec++10.2.0bitsios_base.h:41,
  1278.                  from c:usersavkolgccincludec++10.2.0ios:42,
  1279.                  from c:usersavkolgccincludec++10.2.0ostream:38,
  1280.                  from c:usersavkolgccincludec++10.2.0iostream:39,
  1281.                  from test.cpp:1:
  1282. C:MinGWinclude/stdlib.h:562:48: error: 'size_t' was not declared in this scope; did you mean 'std::size_t'?
  1283.   562 | _CRTIMP __cdecl __MINGW_NOTHROW  void *calloc (size_t, size_t) __MINGW_ATTRIB_MALLOC;
  1284.       |                                                ^~~~~~
  1285.       |                                                std::size_t
  1286. In file included from c:usersavkolgccincludec++10.2.0iostream:38,
  1287.                  from test.cpp:1:
  1288. c:usersavkolgccincludec++10.2.0x86_64-w64-mingw32bitsc++config.h:260:26: note: 'std::size_t' declared here
  1289.   260 |   typedef __SIZE_TYPE__  size_t;
  1290.       |                          ^~~~~~
  1291. In file included from c:usersavkolgccx86_64-w64-mingw32includesec_apistdlib_s.h:9,
  1292.                  from c:usersavkolgccx86_64-w64-mingw32includestdlib.h:694,
  1293.                  from c:usersavkolgccincludec++10.2.0cstdlib:75,
  1294.                  from c:usersavkolgccincludec++10.2.0extstring_conversions.h:41,
  1295.                  from c:usersavkolgccincludec++10.2.0bitsbasic_string.h:6535,
  1296.                  from c:usersavkolgccincludec++10.2.0string:55,
  1297.                  from c:usersavkolgccincludec++10.2.0bitslocale_classes.h:40,
  1298.                  from c:usersavkolgccincludec++10.2.0bitsios_base.h:41,
  1299.                  from c:usersavkolgccincludec++10.2.0ios:42,
  1300.                  from c:usersavkolgccincludec++10.2.0ostream:38,
  1301.                  from c:usersavkolgccincludec++10.2.0iostream:39,
  1302.                  from test.cpp:1:
  1303. C:MinGWinclude/stdlib.h:562:56: error: 'size_t' was not declared in this scope; did you mean 'std::size_t'?
  1304.   562 | _CRTIMP __cdecl __MINGW_NOTHROW  void *calloc (size_t, size_t) __MINGW_ATTRIB_MALLOC;
  1305.       |                                                        ^~~~~~
  1306.       |                                                        std::size_t
  1307. In file included from c:usersavkolgccincludec++10.2.0iostream:38,
  1308.                  from test.cpp:1:
  1309. c:usersavkolgccincludec++10.2.0x86_64-w64-mingw32bitsc++config.h:260:26: note: 'std::size_t' declared here
  1310.   260 |   typedef __SIZE_TYPE__  size_t;
  1311.       |                          ^~~~~~
  1312. In file included from C:MinGWinclude/wchar.h:54,
  1313.                  from c:usersavkolgccincludec++10.2.0cwchar:44,
  1314.                  from c:usersavkolgccincludec++10.2.0bitspostypes.h:40,
  1315.                  from c:usersavkolgccincludec++10.2.0iosfwd:40,
  1316.                  from c:usersavkolgccincludec++10.2.0ios:38,
  1317.                  from c:usersavkolgccincludec++10.2.0ostream:38,
  1318.                  from c:usersavkolgccincludec++10.2.0iostream:39,
  1319.                  from test.cpp:1:
  1320. C:MinGWinclude/stdlib.h:562:64: error: attributes after parenthesized initializer ignored [-fpermissive]
  1321.   562 | _CRTIMP __cdecl __MINGW_NOTHROW  void *calloc (size_t, size_t) __MINGW_ATTRIB_MALLOC;
  1322.       |                                                                ^~~~~~~~~~~~~~~~~~~~~
  1323. In file included from c:usersavkolgccx86_64-w64-mingw32includesec_apistdlib_s.h:9,
  1324.                  from c:usersavkolgccx86_64-w64-mingw32includestdlib.h:694,
  1325.                  from c:usersavkolgccincludec++10.2.0cstdlib:75,
  1326.                  from c:usersavkolgccincludec++10.2.0extstring_conversions.h:41,
  1327.                  from c:usersavkolgccincludec++10.2.0bitsbasic_string.h:6535,
  1328.                  from c:usersavkolgccincludec++10.2.0string:55,
  1329.                  from c:usersavkolgccincludec++10.2.0bitslocale_classes.h:40,
  1330.                  from c:usersavkolgccincludec++10.2.0bitsios_base.h:41,
  1331.                  from c:usersavkolgccincludec++10.2.0ios:42,
  1332.                  from c:usersavkolgccincludec++10.2.0ostream:38,
  1333.                  from c:usersavkolgccincludec++10.2.0iostream:39,
  1334.                  from test.cpp:1:
  1335. C:MinGWinclude/stdlib.h:563:40: error: redefinition of 'void* malloc'
  1336.   563 | _CRTIMP __cdecl __MINGW_NOTHROW  void *malloc (size_t) __MINGW_ATTRIB_MALLOC;
  1337.       |                                        ^~~~~~
  1338. In file included from c:usersavkolgccincludec++10.2.0cstdlib:75,
  1339.                  from c:usersavkolgccincludec++10.2.0extstring_conversions.h:41,
  1340.                  from c:usersavkolgccincludec++10.2.0bitsbasic_string.h:6535,
  1341.                  from c:usersavkolgccincludec++10.2.0string:55,
  1342.                  from c:usersavkolgccincludec++10.2.0bitslocale_classes.h:40,
  1343.                  from c:usersavkolgccincludec++10.2.0bitsios_base.h:41,
  1344.                  from c:usersavkolgccincludec++10.2.0ios:42,
  1345.                  from c:usersavkolgccincludec++10.2.0ostream:38,
  1346.                  from c:usersavkolgccincludec++10.2.0iostream:39,
  1347.                  from test.cpp:1:
  1348. c:usersavkolgccx86_64-w64-mingw32includestdlib.h:457:17: note: 'void* malloc' previously defined here
  1349.   457 |   void *__cdecl malloc(size_t _Size);
  1350.       |                 ^~~~~~
  1351. In file included from c:usersavkolgccx86_64-w64-mingw32includesec_apistdlib_s.h:9,
  1352.                  from c:usersavkolgccx86_64-w64-mingw32includestdlib.h:694,
  1353.                  from c:usersavkolgccincludec++10.2.0cstdlib:75,
  1354.                  from c:usersavkolgccincludec++10.2.0extstring_conversions.h:41,
  1355.                  from c:usersavkolgccincludec++10.2.0bitsbasic_string.h:6535,
  1356.                  from c:usersavkolgccincludec++10.2.0string:55,
  1357.                  from c:usersavkolgccincludec++10.2.0bitslocale_classes.h:40,
  1358.                  from c:usersavkolgccincludec++10.2.0bitsios_base.h:41,
  1359.                  from c:usersavkolgccincludec++10.2.0ios:42,
  1360.                  from c:usersavkolgccincludec++10.2.0ostream:38,
  1361.                  from c:usersavkolgccincludec++10.2.0iostream:39,
  1362.                  from test.cpp:1:
  1363. C:MinGWinclude/stdlib.h:563:48: error: 'size_t' was not declared in this scope; did you mean 'std::size_t'?
  1364.   563 | _CRTIMP __cdecl __MINGW_NOTHROW  void *malloc (size_t) __MINGW_ATTRIB_MALLOC;
  1365.       |                                                ^~~~~~
  1366.       |                                                std::size_t
  1367. In file included from c:usersavkolgccincludec++10.2.0iostream:38,
  1368.                  from test.cpp:1:
  1369. c:usersavkolgccincludec++10.2.0x86_64-w64-mingw32bitsc++config.h:260:26: note: 'std::size_t' declared here
  1370.   260 |   typedef __SIZE_TYPE__  size_t;
  1371.       |                          ^~~~~~
  1372. In file included from C:MinGWinclude/wchar.h:54,
  1373.                  from c:usersavkolgccincludec++10.2.0cwchar:44,
  1374.                  from c:usersavkolgccincludec++10.2.0bitspostypes.h:40,
  1375.                  from c:usersavkolgccincludec++10.2.0iosfwd:40,
  1376.                  from c:usersavkolgccincludec++10.2.0ios:38,
  1377.                  from c:usersavkolgccincludec++10.2.0ostream:38,
  1378.                  from c:usersavkolgccincludec++10.2.0iostream:39,
  1379.                  from test.cpp:1:
  1380. C:MinGWinclude/stdlib.h:563:56: error: attributes after parenthesized initializer ignored [-fpermissive]
  1381.   563 | _CRTIMP __cdecl __MINGW_NOTHROW  void *malloc (size_t) __MINGW_ATTRIB_MALLOC;
  1382.       |                                                        ^~~~~~~~~~~~~~~~~~~~~
  1383. In file included from c:usersavkolgccx86_64-w64-mingw32includesec_apistdlib_s.h:9,
  1384.                  from c:usersavkolgccx86_64-w64-mingw32includestdlib.h:694,
  1385.                  from c:usersavkolgccincludec++10.2.0cstdlib:75,
  1386.                  from c:usersavkolgccincludec++10.2.0extstring_conversions.h:41,
  1387.                  from c:usersavkolgccincludec++10.2.0bitsbasic_string.h:6535,
  1388.                  from c:usersavkolgccincludec++10.2.0string:55,
  1389.                  from c:usersavkolgccincludec++10.2.0bitslocale_classes.h:40,
  1390.                  from c:usersavkolgccincludec++10.2.0bitsios_base.h:41,
  1391.                  from c:usersavkolgccincludec++10.2.0ios:42,
  1392.                  from c:usersavkolgccincludec++10.2.0ostream:38,
  1393.                  from c:usersavkolgccincludec++10.2.0iostream:39,
  1394.                  from test.cpp:1:
  1395. C:MinGWinclude/stdlib.h:564:57: error: 'size_t' has not been declared
  1396.   564 | _CRTIMP __cdecl __MINGW_NOTHROW  void *realloc (void *, size_t);
  1397.       |                                                         ^~~~~~
  1398. C:MinGWinclude/stdlib.h:574:57: error: 'size_t' has not been declared
  1399.   574 | __cdecl __MINGW_NOTHROW  void *__mingw_realloc (void *, size_t);
  1400.       |                                                         ^~~~~~
  1401. C:MinGWinclude/stdlib.h:589:66: error: 'size_t' has not been declared
  1402.   589 | __CRT_ALIAS __cdecl __MINGW_NOTHROW  void *realloc (void *__ptr, size_t __want)
  1403.       |                                                                  ^~~~~~
  1404. C:MinGWinclude/stdlib.h:624:38: error: 'size_t' was not declared in this scope; did you mean 'std::size_t'?
  1405.   624 | void *__mingw_aligned_offset_malloc (size_t, size_t, size_t);
  1406.       |                                      ^~~~~~
  1407.       |                                      std::size_t
  1408. In file included from c:usersavkolgccincludec++10.2.0iostream:38,
  1409.                  from test.cpp:1:
  1410. c:usersavkolgccincludec++10.2.0x86_64-w64-mingw32bitsc++config.h:260:26: note: 'std::size_t' declared here
  1411.   260 |   typedef __SIZE_TYPE__  size_t;
  1412.       |                          ^~~~~~
  1413. In file included from c:usersavkolgccx86_64-w64-mingw32includesec_apistdlib_s.h:9,
  1414.                  from c:usersavkolgccx86_64-w64-mingw32includestdlib.h:694,
  1415.                  from c:usersavkolgccincludec++10.2.0cstdlib:75,
  1416.                  from c:usersavkolgccincludec++10.2.0extstring_conversions.h:41,
  1417.                  from c:usersavkolgccincludec++10.2.0bitsbasic_string.h:6535,
  1418.                  from c:usersavkolgccincludec++10.2.0string:55,
  1419.                  from c:usersavkolgccincludec++10.2.0bitslocale_classes.h:40,
  1420.                  from c:usersavkolgccincludec++10.2.0bitsios_base.h:41,
  1421.                  from c:usersavkolgccincludec++10.2.0ios:42,
  1422.                  from c:usersavkolgccincludec++10.2.0ostream:38,
  1423.                  from c:usersavkolgccincludec++10.2.0iostream:39,
  1424.                  from test.cpp:1:
  1425. C:MinGWinclude/stdlib.h:624:46: error: 'size_t' was not declared in this scope; did you mean 'std::size_t'?
  1426.   624 | void *__mingw_aligned_offset_malloc (size_t, size_t, size_t);
  1427.       |                                              ^~~~~~
  1428.       |                                              std::size_t
  1429. In file included from c:usersavkolgccincludec++10.2.0iostream:38,
  1430.                  from test.cpp:1:
  1431. c:usersavkolgccincludec++10.2.0x86_64-w64-mingw32bitsc++config.h:260:26: note: 'std::size_t' declared here
  1432.   260 |   typedef __SIZE_TYPE__  size_t;
  1433.       |                          ^~~~~~
  1434. In file included from c:usersavkolgccx86_64-w64-mingw32includesec_apistdlib_s.h:9,
  1435.                  from c:usersavkolgccx86_64-w64-mingw32includestdlib.h:694,
  1436.                  from c:usersavkolgccincludec++10.2.0cstdlib:75,
  1437.                  from c:usersavkolgccincludec++10.2.0extstring_conversions.h:41,
  1438.                  from c:usersavkolgccincludec++10.2.0bitsbasic_string.h:6535,
  1439.                  from c:usersavkolgccincludec++10.2.0string:55,
  1440.                  from c:usersavkolgccincludec++10.2.0bitslocale_classes.h:40,
  1441.                  from c:usersavkolgccincludec++10.2.0bitsios_base.h:41,
  1442.                  from c:usersavkolgccincludec++10.2.0ios:42,
  1443.                  from c:usersavkolgccincludec++10.2.0ostream:38,
  1444.                  from c:usersavkolgccincludec++10.2.0iostream:39,
  1445.                  from test.cpp:1:
  1446. C:MinGWinclude/stdlib.h:624:54: error: 'size_t' was not declared in this scope; did you mean 'std::size_t'?
  1447.   624 | void *__mingw_aligned_offset_malloc (size_t, size_t, size_t);
  1448.       |                                                      ^~~~~~
  1449.       |                                                      std::size_t
  1450. In file included from c:usersavkolgccincludec++10.2.0iostream:38,
  1451.                  from test.cpp:1:
  1452. c:usersavkolgccincludec++10.2.0x86_64-w64-mingw32bitsc++config.h:260:26: note: 'std::size_t' declared here
  1453.   260 |   typedef __SIZE_TYPE__  size_t;
  1454.       |                          ^~~~~~
  1455. In file included from c:usersavkolgccx86_64-w64-mingw32includesec_apistdlib_s.h:9,
  1456.                  from c:usersavkolgccx86_64-w64-mingw32includestdlib.h:694,
  1457.                  from c:usersavkolgccincludec++10.2.0cstdlib:75,
  1458.                  from c:usersavkolgccincludec++10.2.0extstring_conversions.h:41,
  1459.                  from c:usersavkolgccincludec++10.2.0bitsbasic_string.h:6535,
  1460.                  from c:usersavkolgccincludec++10.2.0string:55,
  1461.                  from c:usersavkolgccincludec++10.2.0bitslocale_classes.h:40,
  1462.                  from c:usersavkolgccincludec++10.2.0bitsios_base.h:41,
  1463.                  from c:usersavkolgccincludec++10.2.0ios:42,
  1464.                  from c:usersavkolgccincludec++10.2.0ostream:38,
  1465.                  from c:usersavkolgccincludec++10.2.0iostream:39,
  1466.                  from test.cpp:1:
  1467. C:MinGWinclude/stdlib.h:624:60: error: expression list treated as compound expression in initializer [-fpermissive]
  1468.   624 | void *__mingw_aligned_offset_malloc (size_t, size_t, size_t);
  1469.       |                                                            ^
  1470. C:MinGWinclude/stdlib.h:637:33: error: 'size_t' has not been declared
  1471.   637 | int posix_memalign (void **__p, size_t __alignment, size_t __want)
  1472.       |                                 ^~~~~~
  1473. C:MinGWinclude/stdlib.h:637:53: error: 'size_t' has not been declared
  1474.   637 | int posix_memalign (void **__p, size_t __alignment, size_t __want)
  1475.       |                                                     ^~~~~~
  1476. C:MinGWinclude/stdlib.h: In function 'int posix_memalign(void**, int, int)':
  1477. C:MinGWinclude/stdlib.h:639:63: error: 'size_t' was not declared in this scope; did you mean 'std::size_t'?
  1478.   639 |   *__p = __mingw_aligned_offset_malloc (__want, __alignment, (size_t)(0));
  1479.       |                                                               ^~~~~~
  1480.       |                                                               std::size_t
  1481. In file included from c:usersavkolgccincludec++10.2.0iostream:38,
  1482.                  from test.cpp:1:
  1483. c:usersavkolgccincludec++10.2.0x86_64-w64-mingw32bitsc++config.h:260:26: note: 'std::size_t' declared here
  1484.   260 |   typedef __SIZE_TYPE__  size_t;
  1485.       |                          ^~~~~~
  1486. In file included from c:usersavkolgccx86_64-w64-mingw32includesec_apistdlib_s.h:9,
  1487.                  from c:usersavkolgccx86_64-w64-mingw32includestdlib.h:694,
  1488.                  from c:usersavkolgccincludec++10.2.0cstdlib:75,
  1489.                  from c:usersavkolgccincludec++10.2.0extstring_conversions.h:41,
  1490.                  from c:usersavkolgccincludec++10.2.0bitsbasic_string.h:6535,
  1491.                  from c:usersavkolgccincludec++10.2.0string:55,
  1492.                  from c:usersavkolgccincludec++10.2.0bitslocale_classes.h:40,
  1493.                  from c:usersavkolgccincludec++10.2.0bitsios_base.h:41,
  1494.                  from c:usersavkolgccincludec++10.2.0ios:42,
  1495.                  from c:usersavkolgccincludec++10.2.0ostream:38,
  1496.                  from c:usersavkolgccincludec++10.2.0iostream:39,
  1497.                  from test.cpp:1:
  1498. C:MinGWinclude/stdlib.h:639:73: error: '__mingw_aligned_offset_malloc' cannot be used as a function
  1499.   639 |   *__p = __mingw_aligned_offset_malloc (__want, __alignment, (size_t)(0));
  1500.       |                                                                         ^
  1501. C:MinGWinclude/stdlib.h: At global scope:
  1502. C:MinGWinclude/stdlib.h:650:30: error: 'size_t' has not been declared
  1503.   650 | (const void *, const void *, size_t, size_t, int (*)(const void *, const void *));
  1504.       |                              ^~~~~~
  1505. C:MinGWinclude/stdlib.h:650:38: error: 'size_t' has not been declared
  1506.   650 | (const void *, const void *, size_t, size_t, int (*)(const void *, const void *));
  1507.       |                                      ^~~~~~
  1508. C:MinGWinclude/stdlib.h:653:10: error: 'size_t' has not been declared
  1509.   653 | (void *, size_t, size_t, int (*)(const void *, const void *));
  1510.       |          ^~~~~~
  1511. C:MinGWinclude/stdlib.h:653:18: error: 'size_t' has not been declared
  1512.   653 | (void *, size_t, size_t, int (*)(const void *, const void *));
  1513.       |                  ^~~~~~
  1514. C:MinGWinclude/stdlib.h:665:35: error: conflicting declaration 'typedef struct div_t div_t'
  1515.   665 | typedef struct { int quot, rem; } div_t;
  1516.       |                                   ^~~~~
  1517. In file included from c:usersavkolgccincludec++10.2.0cstdlib:75,
  1518.                  from c:usersavkolgccincludec++10.2.0extstring_conversions.h:41,
  1519.                  from c:usersavkolgccincludec++10.2.0bitsbasic_string.h:6535,
  1520.                  from c:usersavkolgccincludec++10.2.0string:55,
  1521.                  from c:usersavkolgccincludec++10.2.0bitslocale_classes.h:40,
  1522.                  from c:usersavkolgccincludec++10.2.0bitsios_base.h:41,
  1523.                  from c:usersavkolgccincludec++10.2.0ios:42,
  1524.                  from c:usersavkolgccincludec++10.2.0ostream:38,
  1525.                  from c:usersavkolgccincludec++10.2.0iostream:39,
  1526.                  from test.cpp:1:
  1527. c:usersavkolgccx86_64-w64-mingw32includestdlib.h:62:5: note: previous declaration as 'typedef struct _div_t div_t'
  1528.    62 |   } div_t;
  1529.       |     ^~~~~
  1530. In file included from c:usersavkolgccx86_64-w64-mingw32includesec_apistdlib_s.h:9,
  1531.                  from c:usersavkolgccx86_64-w64-mingw32includestdlib.h:694,
  1532.                  from c:usersavkolgccincludec++10.2.0cstdlib:75,
  1533.                  from c:usersavkolgccincludec++10.2.0extstring_conversions.h:41,
  1534.                  from c:usersavkolgccincludec++10.2.0bitsbasic_string.h:6535,
  1535.                  from c:usersavkolgccincludec++10.2.0string:55,
  1536.                  from c:usersavkolgccincludec++10.2.0bitslocale_classes.h:40,
  1537.                  from c:usersavkolgccincludec++10.2.0bitsios_base.h:41,
  1538.                  from c:usersavkolgccincludec++10.2.0ios:42,
  1539.                  from c:usersavkolgccincludec++10.2.0ostream:38,
  1540.                  from c:usersavkolgccincludec++10.2.0iostream:39,
  1541.                  from test.cpp:1:
  1542. C:MinGWinclude/stdlib.h:666:36: error: conflicting declaration 'typedef struct ldiv_t ldiv_t'
  1543.   666 | typedef struct { long quot, rem; } ldiv_t;
  1544.       |                                    ^~~~~~
  1545. In file included from c:usersavkolgccincludec++10.2.0cstdlib:75,
  1546.                  from c:usersavkolgccincludec++10.2.0extstring_conversions.h:41,
  1547.                  from c:usersavkolgccincludec++10.2.0bitsbasic_string.h:6535,
  1548.                  from c:usersavkolgccincludec++10.2.0string:55,
  1549.                  from c:usersavkolgccincludec++10.2.0bitslocale_classes.h:40,
  1550.                  from c:usersavkolgccincludec++10.2.0bitsios_base.h:41,
  1551.                  from c:usersavkolgccincludec++10.2.0ios:42,
  1552.                  from c:usersavkolgccincludec++10.2.0ostream:38,
  1553.                  from c:usersavkolgccincludec++10.2.0iostream:39,
  1554.                  from test.cpp:1:
  1555. c:usersavkolgccx86_64-w64-mingw32includestdlib.h:67:5: note: previous declaration as 'typedef struct _ldiv_t ldiv_t'
  1556.    67 |   } ldiv_t;
  1557.       |     ^~~~~~
  1558. In file included from c:usersavkolgccx86_64-w64-mingw32includesec_apistdlib_s.h:9,
  1559.                  from c:usersavkolgccx86_64-w64-mingw32includestdlib.h:694,
  1560.                  from c:usersavkolgccincludec++10.2.0cstdlib:75,
  1561.                  from c:usersavkolgccincludec++10.2.0extstring_conversions.h:41,
  1562.                  from c:usersavkolgccincludec++10.2.0bitsbasic_string.h:6535,
  1563.                  from c:usersavkolgccincludec++10.2.0string:55,
  1564.                  from c:usersavkolgccincludec++10.2.0bitslocale_classes.h:40,
  1565.                  from c:usersavkolgccincludec++10.2.0bitsios_base.h:41,
  1566.                  from c:usersavkolgccincludec++10.2.0ios:42,
  1567.                  from c:usersavkolgccincludec++10.2.0ostream:38,
  1568.                  from c:usersavkolgccincludec++10.2.0iostream:39,
  1569.                  from test.cpp:1:
  1570. C:MinGWinclude/stdlib.h:715:71: error: 'size_t' has not been declared
  1571.   715 | _CRTIMP __cdecl __MINGW_NOTHROW  char *_fullpath (char*, const char*, size_t);
  1572.       |                                                                       ^~~~~~
  1573. C:MinGWinclude/stdlib.h:802:41: error: conflicting declaration 'typedef struct lldiv_t lldiv_t'
  1574.   802 | typedef struct { long long quot, rem; } lldiv_t;
  1575.       |                                         ^~~~~~~
  1576. In file included from c:usersavkolgccincludec++10.2.0cstdlib:75,
  1577.                  from c:usersavkolgccincludec++10.2.0extstring_conversions.h:41,
  1578.                  from c:usersavkolgccincludec++10.2.0bitsbasic_string.h:6535,
  1579.                  from c:usersavkolgccincludec++10.2.0string:55,
  1580.                  from c:usersavkolgccincludec++10.2.0bitslocale_classes.h:40,
  1581.                  from c:usersavkolgccincludec++10.2.0bitsios_base.h:41,
  1582.                  from c:usersavkolgccincludec++10.2.0ios:42,
  1583.                  from c:usersavkolgccincludec++10.2.0ostream:38,
  1584.                  from c:usersavkolgccincludec++10.2.0iostream:39,
  1585.                  from test.cpp:1:
  1586. c:usersavkolgccx86_64-w64-mingw32includestdlib.h:653:61: note: previous declaration as 'typedef struct lldiv_t lldiv_t'
  1587.   653 |   typedef struct { __MINGW_EXTENSION long long quot, rem; } lldiv_t;
  1588.       |                                                             ^~~~~~~
  1589. In file included from c:usersavkolgccx86_64-w64-mingw32includestdlib.h:695,
  1590.                  from c:usersavkolgccincludec++10.2.0cstdlib:75,
  1591.                  from c:usersavkolgccincludec++10.2.0extstring_conversions.h:41,
  1592.                  from c:usersavkolgccincludec++10.2.0bitsbasic_string.h:6535,
  1593.                  from c:usersavkolgccincludec++10.2.0string:55,
  1594.                  from c:usersavkolgccincludec++10.2.0bitslocale_classes.h:40,
  1595.                  from c:usersavkolgccincludec++10.2.0bitsios_base.h:41,
  1596.                  from c:usersavkolgccincludec++10.2.0ios:42,
  1597.                  from c:usersavkolgccincludec++10.2.0ostream:38,
  1598.                  from c:usersavkolgccincludec++10.2.0iostream:39,
  1599.                  from test.cpp:1:
  1600. C:MinGWinclude/malloc.h:58:3: error: 'size_t' does not name a type
  1601.    58 |   size_t  _size;
  1602.       |   ^~~~~~
  1603. In file included from c:usersavkolgccx86_64-w64-mingw32includestdlib.h:695,
  1604.                  from c:usersavkolgccincludec++10.2.0cstdlib:75,
  1605.                  from c:usersavkolgccincludec++10.2.0extstring_conversions.h:41,
  1606.                  from c:usersavkolgccincludec++10.2.0bitsbasic_string.h:6535,
  1607.                  from c:usersavkolgccincludec++10.2.0string:55,
  1608.                  from c:usersavkolgccincludec++10.2.0bitslocale_classes.h:40,
  1609.                  from c:usersavkolgccincludec++10.2.0bitsios_base.h:41,
  1610.                  from c:usersavkolgccincludec++10.2.0ios:42,
  1611.                  from c:usersavkolgccincludec++10.2.0ostream:38,
  1612.                  from c:usersavkolgccincludec++10.2.0iostream:39,
  1613.                  from test.cpp:1:
  1614. C:MinGWinclude/malloc.h:1:1: note: 'size_t' is defined in header '<cstddef>'; did you forget to '#include <cstddef>'?
  1615.   +++ |+#include <cstddef>
  1616.     1 | /*
  1617. In file included from c:usersavkolgccx86_64-w64-mingw32includestdlib.h:695,
  1618.                  from c:usersavkolgccincludec++10.2.0cstdlib:75,
  1619.                  from c:usersavkolgccincludec++10.2.0extstring_conversions.h:41,
  1620.                  from c:usersavkolgccincludec++10.2.0bitsbasic_string.h:6535,
  1621.                  from c:usersavkolgccincludec++10.2.0string:55,
  1622.                  from c:usersavkolgccincludec++10.2.0bitslocale_classes.h:40,
  1623.                  from c:usersavkolgccincludec++10.2.0bitsios_base.h:41,
  1624.                  from c:usersavkolgccincludec++10.2.0ios:42,
  1625.                  from c:usersavkolgccincludec++10.2.0ostream:38,
  1626.                  from c:usersavkolgccincludec++10.2.0iostream:39,
  1627.                  from test.cpp:1:
  1628. C:MinGWinclude/malloc.h:92:34: error: 'size_t' does not name a type
  1629.    92 | _CRTIMP __cdecl __MINGW_NOTHROW  size_t _msize (void *);
  1630.       |                                  ^~~~~~
  1631. C:MinGWinclude/malloc.h:92:34: note: 'size_t' is defined in header '<cstddef>'; did you forget to '#include <cstddef>'?
  1632. C:MinGWinclude/malloc.h:93:34: error: 'size_t' does not name a type
  1633.    93 | _CRTIMP __cdecl __MINGW_NOTHROW  size_t _get_sbh_threshold (void);
  1634.       |                                  ^~~~~~
  1635. C:MinGWinclude/malloc.h:93:34: note: 'size_t' is defined in header '<cstddef>'; did you forget to '#include <cstddef>'?
  1636. C:MinGWinclude/malloc.h:94:61: error: 'size_t' was not declared in this scope; did you mean 'std::size_t'?
  1637.    94 | _CRTIMP __cdecl __MINGW_NOTHROW  int    _set_sbh_threshold (size_t);
  1638.       |                                                             ^~~~~~
  1639.       |                                                             std::size_t
  1640. In file included from c:usersavkolgccincludec++10.2.0iostream:38,
  1641.                  from test.cpp:1:
  1642. c:usersavkolgccincludec++10.2.0x86_64-w64-mingw32bitsc++config.h:260:26: note: 'std::size_t' declared here
  1643.   260 |   typedef __SIZE_TYPE__  size_t;
  1644.       |                          ^~~~~~
  1645. In file included from c:usersavkolgccx86_64-w64-mingw32includestdlib.h:695,
  1646.                  from c:usersavkolgccincludec++10.2.0cstdlib:75,
  1647.                  from c:usersavkolgccincludec++10.2.0extstring_conversions.h:41,
  1648.                  from c:usersavkolgccincludec++10.2.0bitsbasic_string.h:6535,
  1649.                  from c:usersavkolgccincludec++10.2.0string:55,
  1650.                  from c:usersavkolgccincludec++10.2.0bitslocale_classes.h:40,
  1651.                  from c:usersavkolgccincludec++10.2.0bitsios_base.h:41,
  1652.                  from c:usersavkolgccincludec++10.2.0ios:42,
  1653.                  from c:usersavkolgccincludec++10.2.0ostream:38,
  1654.                  from c:usersavkolgccincludec++10.2.0iostream:39,
  1655.                  from test.cpp:1:
  1656. C:MinGWinclude/malloc.h:95:58: error: 'size_t' has not been declared
  1657.    95 | _CRTIMP __cdecl __MINGW_NOTHROW  void  *_expand (void *, size_t);
  1658.       |                                                          ^~~~~~
  1659. C:MinGWinclude/malloc.h:143:31: error: 'size_t' was not declared in this scope; did you mean 'std::size_t'?
  1660.   143 | void *__mingw_aligned_malloc (size_t, size_t);
  1661.       |                               ^~~~~~
  1662.       |                               std::size_t
  1663. In file included from c:usersavkolgccincludec++10.2.0iostream:38,
  1664.                  from test.cpp:1:
  1665. c:usersavkolgccincludec++10.2.0x86_64-w64-mingw32bitsc++config.h:260:26: note: 'std::size_t' declared here
  1666.   260 |   typedef __SIZE_TYPE__  size_t;
  1667.       |                          ^~~~~~
  1668. In file included from c:usersavkolgccx86_64-w64-mingw32includestdlib.h:695,
  1669.                  from c:usersavkolgccincludec++10.2.0cstdlib:75,
  1670.                  from c:usersavkolgccincludec++10.2.0extstring_conversions.h:41,
  1671.                  from c:usersavkolgccincludec++10.2.0bitsbasic_string.h:6535,
  1672.                  from c:usersavkolgccincludec++10.2.0string:55,
  1673.                  from c:usersavkolgccincludec++10.2.0bitslocale_classes.h:40,
  1674.                  from c:usersavkolgccincludec++10.2.0bitsios_base.h:41,
  1675.                  from c:usersavkolgccincludec++10.2.0ios:42,
  1676.                  from c:usersavkolgccincludec++10.2.0ostream:38,
  1677.                  from c:usersavkolgccincludec++10.2.0iostream:39,
  1678.                  from test.cpp:1:
  1679. C:MinGWinclude/malloc.h:143:39: error: 'size_t' was not declared in this scope; did you mean 'std::size_t'?
  1680.   143 | void *__mingw_aligned_malloc (size_t, size_t);
  1681.       |                                       ^~~~~~
  1682.       |                                       std::size_t
  1683. In file included from c:usersavkolgccincludec++10.2.0iostream:38,
  1684.                  from test.cpp:1:
  1685. c:usersavkolgccincludec++10.2.0x86_64-w64-mingw32bitsc++config.h:260:26: note: 'std::size_t' declared here
  1686.   260 |   typedef __SIZE_TYPE__  size_t;
  1687.       |                          ^~~~~~
  1688. In file included from c:usersavkolgccx86_64-w64-mingw32includestdlib.h:695,
  1689.                  from c:usersavkolgccincludec++10.2.0cstdlib:75,
  1690.                  from c:usersavkolgccincludec++10.2.0extstring_conversions.h:41,
  1691.                  from c:usersavkolgccincludec++10.2.0bitsbasic_string.h:6535,
  1692.                  from c:usersavkolgccincludec++10.2.0string:55,
  1693.                  from c:usersavkolgccincludec++10.2.0bitslocale_classes.h:40,
  1694.                  from c:usersavkolgccincludec++10.2.0bitsios_base.h:41,
  1695.                  from c:usersavkolgccincludec++10.2.0ios:42,
  1696.                  from c:usersavkolgccincludec++10.2.0ostream:38,
  1697.                  from c:usersavkolgccincludec++10.2.0iostream:39,
  1698.                  from test.cpp:1:
  1699. C:MinGWinclude/malloc.h:143:45: error: expression list treated as compound expression in initializer [-fpermissive]
  1700.   143 | void *__mingw_aligned_malloc (size_t, size_t);
  1701.       |                                             ^
  1702. C:MinGWinclude/malloc.h:146:7: error: redefinition of 'void* __mingw_aligned_offset_malloc'
  1703.   146 | void *__mingw_aligned_offset_malloc (size_t, size_t, size_t);
  1704.       |       ^~~~~~~~~~~~~~~~~~~~~~~~~~~~~
  1705. In file included from c:usersavkolgccx86_64-w64-mingw32includesec_apistdlib_s.h:9,
  1706.                  from c:usersavkolgccx86_64-w64-mingw32includestdlib.h:694,
  1707.                  from c:usersavkolgccincludec++10.2.0cstdlib:75,
  1708.                  from c:usersavkolgccincludec++10.2.0extstring_conversions.h:41,
  1709.                  from c:usersavkolgccincludec++10.2.0bitsbasic_string.h:6535,
  1710.                  from c:usersavkolgccincludec++10.2.0string:55,
  1711.                  from c:usersavkolgccincludec++10.2.0bitslocale_classes.h:40,
  1712.                  from c:usersavkolgccincludec++10.2.0bitsios_base.h:41,
  1713.                  from c:usersavkolgccincludec++10.2.0ios:42,
  1714.                  from c:usersavkolgccincludec++10.2.0ostream:38,
  1715.                  from c:usersavkolgccincludec++10.2.0iostream:39,
  1716.                  from test.cpp:1:
  1717. C:MinGWinclude/stdlib.h:624:7: note: 'void* __mingw_aligned_offset_malloc' previously defined here
  1718.   624 | void *__mingw_aligned_offset_malloc (size_t, size_t, size_t);
  1719.       |       ^~~~~~~~~~~~~~~~~~~~~~~~~~~~~
  1720. In file included from c:usersavkolgccx86_64-w64-mingw32includestdlib.h:695,
  1721.                  from c:usersavkolgccincludec++10.2.0cstdlib:75,
  1722.                  from c:usersavkolgccincludec++10.2.0extstring_conversions.h:41,
  1723.                  from c:usersavkolgccincludec++10.2.0bitsbasic_string.h:6535,
  1724.                  from c:usersavkolgccincludec++10.2.0string:55,
  1725.                  from c:usersavkolgccincludec++10.2.0bitslocale_classes.h:40,
  1726.                  from c:usersavkolgccincludec++10.2.0bitsios_base.h:41,
  1727.                  from c:usersavkolgccincludec++10.2.0ios:42,
  1728.                  from c:usersavkolgccincludec++10.2.0ostream:38,
  1729.                  from c:usersavkolgccincludec++10.2.0iostream:39,
  1730.                  from test.cpp:1:
  1731. C:MinGWinclude/malloc.h:146:38: error: 'size_t' was not declared in this scope; did you mean 'std::size_t'?
  1732.   146 | void *__mingw_aligned_offset_malloc (size_t, size_t, size_t);
  1733.       |                                      ^~~~~~
  1734.       |                                      std::size_t
  1735. In file included from c:usersavkolgccincludec++10.2.0iostream:38,
  1736.                  from test.cpp:1:
  1737. c:usersavkolgccincludec++10.2.0x86_64-w64-mingw32bitsc++config.h:260:26: note: 'std::size_t' declared here
  1738.   260 |   typedef __SIZE_TYPE__  size_t;
  1739.       |                          ^~~~~~
  1740. In file included from c:usersavkolgccx86_64-w64-mingw32includestdlib.h:695,
  1741.                  from c:usersavkolgccincludec++10.2.0cstdlib:75,
  1742.                  from c:usersavkolgccincludec++10.2.0extstring_conversions.h:41,
  1743.                  from c:usersavkolgccincludec++10.2.0bitsbasic_string.h:6535,
  1744.                  from c:usersavkolgccincludec++10.2.0string:55,
  1745.                  from c:usersavkolgccincludec++10.2.0bitslocale_classes.h:40,
  1746.                  from c:usersavkolgccincludec++10.2.0bitsios_base.h:41,
  1747.                  from c:usersavkolgccincludec++10.2.0ios:42,
  1748.                  from c:usersavkolgccincludec++10.2.0ostream:38,
  1749.                  from c:usersavkolgccincludec++10.2.0iostream:39,
  1750.                  from test.cpp:1:
  1751. C:MinGWinclude/malloc.h:146:46: error: 'size_t' was not declared in this scope; did you mean 'std::size_t'?
  1752.   146 | void *__mingw_aligned_offset_malloc (size_t, size_t, size_t);
  1753.       |                                              ^~~~~~
  1754.       |                                              std::size_t
  1755. In file included from c:usersavkolgccincludec++10.2.0iostream:38,
  1756.                  from test.cpp:1:
  1757. c:usersavkolgccincludec++10.2.0x86_64-w64-mingw32bitsc++config.h:260:26: note: 'std::size_t' declared here
  1758.   260 |   typedef __SIZE_TYPE__  size_t;
  1759.       |                          ^~~~~~
  1760. In file included from c:usersavkolgccx86_64-w64-mingw32includestdlib.h:695,
  1761.                  from c:usersavkolgccincludec++10.2.0cstdlib:75,
  1762.                  from c:usersavkolgccincludec++10.2.0extstring_conversions.h:41,
  1763.                  from c:usersavkolgccincludec++10.2.0bitsbasic_string.h:6535,
  1764.                  from c:usersavkolgccincludec++10.2.0string:55,
  1765.                  from c:usersavkolgccincludec++10.2.0bitslocale_classes.h:40,
  1766.                  from c:usersavkolgccincludec++10.2.0bitsios_base.h:41,
  1767.                  from c:usersavkolgccincludec++10.2.0ios:42,
  1768.                  from c:usersavkolgccincludec++10.2.0ostream:38,
  1769.                  from c:usersavkolgccincludec++10.2.0iostream:39,
  1770.                  from test.cpp:1:
  1771. C:MinGWinclude/malloc.h:146:54: error: 'size_t' was not declared in this scope; did you mean 'std::size_t'?
  1772.   146 | void *__mingw_aligned_offset_malloc (size_t, size_t, size_t);
  1773.       |                                                      ^~~~~~
  1774.       |                                                      std::size_t
  1775. In file included from c:usersavkolgccincludec++10.2.0iostream:38,
  1776.                  from test.cpp:1:
  1777. c:usersavkolgccincludec++10.2.0x86_64-w64-mingw32bitsc++config.h:260:26: note: 'std::size_t' declared here
  1778.   260 |   typedef __SIZE_TYPE__  size_t;
  1779.       |                          ^~~~~~
  1780. In file included from c:usersavkolgccx86_64-w64-mingw32includestdlib.h:695,
  1781.                  from c:usersavkolgccincludec++10.2.0cstdlib:75,
  1782.                  from c:usersavkolgccincludec++10.2.0extstring_conversions.h:41,
  1783.                  from c:usersavkolgccincludec++10.2.0bitsbasic_string.h:6535,
  1784.                  from c:usersavkolgccincludec++10.2.0string:55,
  1785.                  from c:usersavkolgccincludec++10.2.0bitslocale_classes.h:40,
  1786.                  from c:usersavkolgccincludec++10.2.0bitsios_base.h:41,
  1787.                  from c:usersavkolgccincludec++10.2.0ios:42,
  1788.                  from c:usersavkolgccincludec++10.2.0ostream:38,
  1789.                  from c:usersavkolgccincludec++10.2.0iostream:39,
  1790.                  from test.cpp:1:
  1791. C:MinGWinclude/malloc.h:149:47: error: 'size_t' has not been declared
  1792.   149 | void *__mingw_aligned_offset_realloc (void *, size_t, size_t, size_t);
  1793.       |                                               ^~~~~~
  1794. C:MinGWinclude/malloc.h:149:55: error: 'size_t' has not been declared
  1795.   149 | void *__mingw_aligned_offset_realloc (void *, size_t, size_t, size_t);
  1796.       |                                                       ^~~~~~
  1797. C:MinGWinclude/malloc.h:149:63: error: 'size_t' has not been declared
  1798.   149 | void *__mingw_aligned_offset_realloc (void *, size_t, size_t, size_t);
  1799.       |                                                               ^~~~~~
  1800. C:MinGWinclude/malloc.h:152:40: error: 'size_t' has not been declared
  1801.   152 | void *__mingw_aligned_realloc (void *, size_t, size_t);
  1802.       |                                        ^~~~~~
  1803. C:MinGWinclude/malloc.h:152:48: error: 'size_t' has not been declared
  1804.   152 | void *__mingw_aligned_realloc (void *, size_t, size_t);
  1805.       |                                                ^~~~~~
  1806. C:MinGWinclude/malloc.h:172:7: error: redefinition of 'void* _aligned_malloc'
  1807.   172 | void *_aligned_malloc (size_t __wanted, size_t __aligned )
  1808.       |       ^~~~~~~~~~~~~~~
  1809. In file included from c:usersavkolgccincludec++10.2.0cstdlib:75,
  1810.                  from c:usersavkolgccincludec++10.2.0extstring_conversions.h:41,
  1811.                  from c:usersavkolgccincludec++10.2.0bitsbasic_string.h:6535,
  1812.                  from c:usersavkolgccincludec++10.2.0string:55,
  1813.                  from c:usersavkolgccincludec++10.2.0bitslocale_classes.h:40,
  1814.                  from c:usersavkolgccincludec++10.2.0bitsios_base.h:41,
  1815.                  from c:usersavkolgccincludec++10.2.0ios:42,
  1816.                  from c:usersavkolgccincludec++10.2.0ostream:38,
  1817.                  from c:usersavkolgccincludec++10.2.0iostream:39,
  1818.                  from test.cpp:1:
  1819. c:usersavkolgccx86_64-w64-mingw32includestdlib.h:467:25: note: 'void* _aligned_malloc' previously defined here
  1820.   467 |   _CRTIMP void *__cdecl _aligned_malloc(size_t _Size,size_t _Alignment);
  1821.       |                         ^~~~~~~~~~~~~~~
  1822. In file included from c:usersavkolgccx86_64-w64-mingw32includestdlib.h:695,
  1823.                  from c:usersavkolgccincludec++10.2.0cstdlib:75,
  1824.                  from c:usersavkolgccincludec++10.2.0extstring_conversions.h:41,
  1825.                  from c:usersavkolgccincludec++10.2.0bitsbasic_string.h:6535,
  1826.                  from c:usersavkolgccincludec++10.2.0string:55,
  1827.                  from c:usersavkolgccincludec++10.2.0bitslocale_classes.h:40,
  1828.                  from c:usersavkolgccincludec++10.2.0bitsios_base.h:41,
  1829.                  from c:usersavkolgccincludec++10.2.0ios:42,
  1830.                  from c:usersavkolgccincludec++10.2.0ostream:38,
  1831.                  from c:usersavkolgccincludec++10.2.0iostream:39,
  1832.                  from test.cpp:1:
  1833. C:MinGWinclude/malloc.h:172:24: error: 'size_t' was not declared in this scope; did you mean 'std::size_t'?
  1834.   172 | void *_aligned_malloc (size_t __wanted, size_t __aligned )
  1835.       |                        ^~~~~~
  1836.       |                        std::size_t
  1837. In file included from c:usersavkolgccincludec++10.2.0iostream:38,
  1838.                  from test.cpp:1:
  1839. c:usersavkolgccincludec++10.2.0x86_64-w64-mingw32bitsc++config.h:260:26: note: 'std::size_t' declared here
  1840.   260 |   typedef __SIZE_TYPE__  size_t;
  1841.       |                          ^~~~~~
  1842. In file included from c:usersavkolgccx86_64-w64-mingw32includestdlib.h:695,
  1843.                  from c:usersavkolgccincludec++10.2.0cstdlib:75,
  1844.                  from c:usersavkolgccincludec++10.2.0extstring_conversions.h:41,
  1845.                  from c:usersavkolgccincludec++10.2.0bitsbasic_string.h:6535,
  1846.                  from c:usersavkolgccincludec++10.2.0string:55,
  1847.                  from c:usersavkolgccincludec++10.2.0bitslocale_classes.h:40,
  1848.                  from c:usersavkolgccincludec++10.2.0bitsios_base.h:41,
  1849.                  from c:usersavkolgccincludec++10.2.0ios:42,
  1850.                  from c:usersavkolgccincludec++10.2.0ostream:38,
  1851.                  from c:usersavkolgccincludec++10.2.0iostream:39,
  1852.                  from test.cpp:1:
  1853. C:MinGWinclude/malloc.h:172:41: error: 'size_t' was not declared in this scope; did you mean 'std::size_t'?
  1854.   172 | void *_aligned_malloc (size_t __wanted, size_t __aligned )
  1855.       |                                         ^~~~~~
  1856.       |                                         std::size_t
  1857. In file included from c:usersavkolgccincludec++10.2.0iostream:38,
  1858.                  from test.cpp:1:
  1859. c:usersavkolgccincludec++10.2.0x86_64-w64-mingw32bitsc++config.h:260:26: note: 'std::size_t' declared here
  1860.   260 |   typedef __SIZE_TYPE__  size_t;
  1861.       |                          ^~~~~~
  1862. In file included from c:usersavkolgccx86_64-w64-mingw32includestdlib.h:695,
  1863.                  from c:usersavkolgccincludec++10.2.0cstdlib:75,
  1864.                  from c:usersavkolgccincludec++10.2.0extstring_conversions.h:41,
  1865.                  from c:usersavkolgccincludec++10.2.0bitsbasic_string.h:6535,
  1866.                  from c:usersavkolgccincludec++10.2.0string:55,
  1867.                  from c:usersavkolgccincludec++10.2.0bitslocale_classes.h:40,
  1868.                  from c:usersavkolgccincludec++10.2.0bitsios_base.h:41,
  1869.                  from c:usersavkolgccincludec++10.2.0ios:42,
  1870.                  from c:usersavkolgccincludec++10.2.0ostream:38,
  1871.                  from c:usersavkolgccincludec++10.2.0iostream:39,
  1872.                  from test.cpp:1:
  1873. C:MinGWinclude/malloc.h:177:7: error: redefinition of 'void* _aligned_offset_malloc'
  1874.   177 | void *_aligned_offset_malloc (size_t __wanted, size_t __aligned, size_t __offset )
  1875.       |       ^~~~~~~~~~~~~~~~~~~~~~
  1876. In file included from c:usersavkolgccincludec++10.2.0cstdlib:75,
  1877.                  from c:usersavkolgccincludec++10.2.0extstring_conversions.h:41,
  1878.                  from c:usersavkolgccincludec++10.2.0bitsbasic_string.h:6535,
  1879.                  from c:usersavkolgccincludec++10.2.0string:55,
  1880.                  from c:usersavkolgccincludec++10.2.0bitslocale_classes.h:40,
  1881.                  from c:usersavkolgccincludec++10.2.0bitsios_base.h:41,
  1882.                  from c:usersavkolgccincludec++10.2.0ios:42,
  1883.                  from c:usersavkolgccincludec++10.2.0ostream:38,
  1884.                  from c:usersavkolgccincludec++10.2.0iostream:39,
  1885.                  from test.cpp:1:
  1886. c:usersavkolgccx86_64-w64-mingw32includestdlib.h:471:25: note: 'void* _aligned_offset_malloc' previously defined here
  1887.   471 |   _CRTIMP void *__cdecl _aligned_offset_malloc(size_t _Size,size_t _Alignment,size_t _Offset);
  1888.       |                         ^~~~~~~~~~~~~~~~~~~~~~
  1889. In file included from c:usersavkolgccx86_64-w64-mingw32includestdlib.h:695,
  1890.                  from c:usersavkolgccincludec++10.2.0cstdlib:75,
  1891.                  from c:usersavkolgccincludec++10.2.0extstring_conversions.h:41,
  1892.                  from c:usersavkolgccincludec++10.2.0bitsbasic_string.h:6535,
  1893.                  from c:usersavkolgccincludec++10.2.0string:55,
  1894.                  from c:usersavkolgccincludec++10.2.0bitslocale_classes.h:40,
  1895.                  from c:usersavkolgccincludec++10.2.0bitsios_base.h:41,
  1896.                  from c:usersavkolgccincludec++10.2.0ios:42,
  1897.                  from c:usersavkolgccincludec++10.2.0ostream:38,
  1898.                  from c:usersavkolgccincludec++10.2.0iostream:39,
  1899.                  from test.cpp:1:
  1900. C:MinGWinclude/malloc.h:177:31: error: 'size_t' was not declared in this scope; did you mean 'std::size_t'?
  1901.   177 | void *_aligned_offset_malloc (size_t __wanted, size_t __aligned, size_t __offset )
  1902.       |                               ^~~~~~
  1903.       |                               std::size_t
  1904. In file included from c:usersavkolgccincludec++10.2.0iostream:38,
  1905.                  from test.cpp:1:
  1906. c:usersavkolgccincludec++10.2.0x86_64-w64-mingw32bitsc++config.h:260:26: note: 'std::size_t' declared here
  1907.   260 |   typedef __SIZE_TYPE__  size_t;
  1908.       |                          ^~~~~~
  1909. In file included from c:usersavkolgccx86_64-w64-mingw32includestdlib.h:695,
  1910.                  from c:usersavkolgccincludec++10.2.0cstdlib:75,
  1911.                  from c:usersavkolgccincludec++10.2.0extstring_conversions.h:41,
  1912.                  from c:usersavkolgccincludec++10.2.0bitsbasic_string.h:6535,
  1913.                  from c:usersavkolgccincludec++10.2.0string:55,
  1914.                  from c:usersavkolgccincludec++10.2.0bitslocale_classes.h:40,
  1915.                  from c:usersavkolgccincludec++10.2.0bitsios_base.h:41,
  1916.                  from c:usersavkolgccincludec++10.2.0ios:42,
  1917.                  from c:usersavkolgccincludec++10.2.0ostream:38,
  1918.                  from c:usersavkolgccincludec++10.2.0iostream:39,
  1919.                  from test.cpp:1:
  1920. C:MinGWinclude/malloc.h:177:48: error: 'size_t' was not declared in this scope; did you mean 'std::size_t'?
  1921.   177 | void *_aligned_offset_malloc (size_t __wanted, size_t __aligned, size_t __offset )
  1922.       |                                                ^~~~~~
  1923.       |                                                std::size_t
  1924. In file included from c:usersavkolgccincludec++10.2.0iostream:38,
  1925.                  from test.cpp:1:
  1926. c:usersavkolgccincludec++10.2.0x86_64-w64-mingw32bitsc++config.h:260:26: note: 'std::size_t' declared here
  1927.   260 |   typedef __SIZE_TYPE__  size_t;
  1928.       |                          ^~~~~~
  1929. In file included from c:usersavkolgccx86_64-w64-mingw32includestdlib.h:695,
  1930.                  from c:usersavkolgccincludec++10.2.0cstdlib:75,
  1931.                  from c:usersavkolgccincludec++10.2.0extstring_conversions.h:41,
  1932.                  from c:usersavkolgccincludec++10.2.0bitsbasic_string.h:6535,
  1933.                  from c:usersavkolgccincludec++10.2.0string:55,
  1934.                  from c:usersavkolgccincludec++10.2.0bitslocale_classes.h:40,
  1935.                  from c:usersavkolgccincludec++10.2.0bitsios_base.h:41,
  1936.                  from c:usersavkolgccincludec++10.2.0ios:42,
  1937.                  from c:usersavkolgccincludec++10.2.0ostream:38,
  1938.                  from c:usersavkolgccincludec++10.2.0iostream:39,
  1939.                  from test.cpp:1:
  1940. C:MinGWinclude/malloc.h:177:66: error: 'size_t' was not declared in this scope; did you mean 'std::size_t'?
  1941.   177 | void *_aligned_offset_malloc (size_t __wanted, size_t __aligned, size_t __offset )
  1942.       |                                                                  ^~~~~~
  1943.       |                                                                  std::size_t
  1944. In file included from c:usersavkolgccincludec++10.2.0iostream:38,
  1945.                  from test.cpp:1:
  1946. c:usersavkolgccincludec++10.2.0x86_64-w64-mingw32bitsc++config.h:260:26: note: 'std::size_t' declared here
  1947.   260 |   typedef __SIZE_TYPE__  size_t;
  1948.       |                          ^~~~~~
  1949. In file included from c:usersavkolgccx86_64-w64-mingw32includestdlib.h:695,
  1950.                  from c:usersavkolgccincludec++10.2.0cstdlib:75,
  1951.                  from c:usersavkolgccincludec++10.2.0extstring_conversions.h:41,
  1952.                  from c:usersavkolgccincludec++10.2.0bitsbasic_string.h:6535,
  1953.                  from c:usersavkolgccincludec++10.2.0string:55,
  1954.                  from c:usersavkolgccincludec++10.2.0bitslocale_classes.h:40,
  1955.                  from c:usersavkolgccincludec++10.2.0bitsios_base.h:41,
  1956.                  from c:usersavkolgccincludec++10.2.0ios:42,
  1957.                  from c:usersavkolgccincludec++10.2.0ostream:38,
  1958.                  from c:usersavkolgccincludec++10.2.0iostream:39,
  1959.                  from test.cpp:1:
  1960. C:MinGWinclude/malloc.h:182:38: error: 'size_t' has not been declared
  1961.   182 | void *_aligned_realloc (void *__ptr, size_t __wanted, size_t __aligned )
  1962.       |                                      ^~~~~~
  1963. C:MinGWinclude/malloc.h:182:55: error: 'size_t' has not been declared
  1964.   182 | void *_aligned_realloc (void *__ptr, size_t __wanted, size_t __aligned )
  1965.       |                                                       ^~~~~~
  1966. C:MinGWinclude/malloc.h: In function 'void* _aligned_realloc(void*, int, int)':
  1967. C:MinGWinclude/malloc.h:183:71: error: 'size_t' was not declared in this scope; did you mean 'std::size_t'?
  1968.   183 | { return __mingw_aligned_offset_realloc (__ptr, __wanted, __aligned, (size_t)(0)); }
  1969.       |                                                                       ^~~~~~
  1970.       |                                                                       std::size_t
  1971. In file included from c:usersavkolgccincludec++10.2.0iostream:38,
  1972.                  from test.cpp:1:
  1973. c:usersavkolgccincludec++10.2.0x86_64-w64-mingw32bitsc++config.h:260:26: note: 'std::size_t' declared here
  1974.   260 |   typedef __SIZE_TYPE__  size_t;
  1975.       |                          ^~~~~~
  1976. In file included from c:usersavkolgccx86_64-w64-mingw32includestdlib.h:695,
  1977.                  from c:usersavkolgccincludec++10.2.0cstdlib:75,
  1978.                  from c:usersavkolgccincludec++10.2.0extstring_conversions.h:41,
  1979.                  from c:usersavkolgccincludec++10.2.0bitsbasic_string.h:6535,
  1980.                  from c:usersavkolgccincludec++10.2.0string:55,
  1981.                  from c:usersavkolgccincludec++10.2.0bitslocale_classes.h:40,
  1982.                  from c:usersavkolgccincludec++10.2.0bitsios_base.h:41,
  1983.                  from c:usersavkolgccincludec++10.2.0ios:42,
  1984.                  from c:usersavkolgccincludec++10.2.0ostream:38,
  1985.                  from c:usersavkolgccincludec++10.2.0iostream:39,
  1986.                  from test.cpp:1:
  1987. C:MinGWinclude/malloc.h: At global scope:
  1988. C:MinGWinclude/malloc.h:187:45: error: 'size_t' has not been declared
  1989.   187 | void *_aligned_offset_realloc (void *__ptr, size_t __wanted, size_t __aligned, size_t __offset )
  1990.       |                                             ^~~~~~
  1991. C:MinGWinclude/malloc.h:187:62: error: 'size_t' has not been declared
  1992.   187 | void *_aligned_offset_realloc (void *__ptr, size_t __wanted, size_t __aligned, size_t __offset )
  1993.       |                                                              ^~~~~~
  1994. C:MinGWinclude/malloc.h:187:80: error: 'size_t' has not been declared
  1995.   187 | void *_aligned_offset_realloc (void *__ptr, size_t __wanted, size_t __aligned, size_t __offset )
  1996.       |                                                                                ^~~~~~
  1997. C:MinGWinclude/malloc.h:203:7: error: redefinition of 'void* __mingw_aligned_malloc'
  1998.   203 | void *__mingw_aligned_malloc( size_t __want, size_t __aligned )
  1999.       |       ^~~~~~~~~~~~~~~~~~~~~~
  2000. C:MinGWinclude/malloc.h:143:7: note: 'void* __mingw_aligned_malloc' previously defined here
  2001.   143 | void *__mingw_aligned_malloc (size_t, size_t);
  2002.       |       ^~~~~~~~~~~~~~~~~~~~~~
  2003. C:MinGWinclude/malloc.h:203:31: error: 'size_t' was not declared in this scope; did you mean 'std::size_t'?
  2004.   203 | void *__mingw_aligned_malloc( size_t __want, size_t __aligned )
  2005.       |                               ^~~~~~
  2006.       |                               std::size_t
  2007. In file included from c:usersavkolgccincludec++10.2.0iostream:38,
  2008.                  from test.cpp:1:
  2009. c:usersavkolgccincludec++10.2.0x86_64-w64-mingw32bitsc++config.h:260:26: note: 'std::size_t' declared here
  2010.   260 |   typedef __SIZE_TYPE__  size_t;
  2011.       |                          ^~~~~~
  2012. In file included from c:usersavkolgccx86_64-w64-mingw32includestdlib.h:695,
  2013.                  from c:usersavkolgccincludec++10.2.0cstdlib:75,
  2014.                  from c:usersavkolgccincludec++10.2.0extstring_conversions.h:41,
  2015.                  from c:usersavkolgccincludec++10.2.0bitsbasic_string.h:6535,
  2016.                  from c:usersavkolgccincludec++10.2.0string:55,
  2017.                  from c:usersavkolgccincludec++10.2.0bitslocale_classes.h:40,
  2018.                  from c:usersavkolgccincludec++10.2.0bitsios_base.h:41,
  2019.                  from c:usersavkolgccincludec++10.2.0ios:42,
  2020.                  from c:usersavkolgccincludec++10.2.0ostream:38,
  2021.                  from c:usersavkolgccincludec++10.2.0iostream:39,
  2022.                  from test.cpp:1:
  2023. C:MinGWinclude/malloc.h:203:46: error: 'size_t' was not declared in this scope; did you mean 'std::size_t'?
  2024.   203 | void *__mingw_aligned_malloc( size_t __want, size_t __aligned )
  2025.       |                                              ^~~~~~
  2026.       |                                              std::size_t
  2027. In file included from c:usersavkolgccincludec++10.2.0iostream:38,
  2028.                  from test.cpp:1:
  2029. c:usersavkolgccincludec++10.2.0x86_64-w64-mingw32bitsc++config.h:260:26: note: 'std::size_t' declared here
  2030.   260 |   typedef __SIZE_TYPE__  size_t;
  2031.       |                          ^~~~~~
  2032. In file included from c:usersavkolgccx86_64-w64-mingw32includestdlib.h:695,
  2033.                  from c:usersavkolgccincludec++10.2.0cstdlib:75,
  2034.                  from c:usersavkolgccincludec++10.2.0extstring_conversions.h:41,
  2035.                  from c:usersavkolgccincludec++10.2.0bitsbasic_string.h:6535,
  2036.                  from c:usersavkolgccincludec++10.2.0string:55,
  2037.                  from c:usersavkolgccincludec++10.2.0bitslocale_classes.h:40,
  2038.                  from c:usersavkolgccincludec++10.2.0bitsios_base.h:41,
  2039.                  from c:usersavkolgccincludec++10.2.0ios:42,
  2040.                  from c:usersavkolgccincludec++10.2.0ostream:38,
  2041.                  from c:usersavkolgccincludec++10.2.0iostream:39,
  2042.                  from test.cpp:1:
  2043. C:MinGWinclude/malloc.h:208:45: error: 'size_t' has not been declared
  2044.   208 | void *__mingw_aligned_realloc( void *__ptr, size_t __want, size_t __aligned )
  2045.       |                                             ^~~~~~
  2046. C:MinGWinclude/malloc.h:208:60: error: 'size_t' has not been declared
  2047.   208 | void *__mingw_aligned_realloc( void *__ptr, size_t __want, size_t __aligned )
  2048.       |                                                            ^~~~~~
  2049. C:MinGWinclude/malloc.h: In function 'void* __mingw_aligned_realloc(void*, int, int)':
  2050. C:MinGWinclude/malloc.h:209:69: error: 'size_t' was not declared in this scope; did you mean 'std::size_t'?
  2051.   209 | { return __mingw_aligned_offset_realloc( __ptr, __want, __aligned, (size_t)(0) ); }
  2052.       |                                                                     ^~~~~~
  2053.       |                                                                     std::size_t
  2054. In file included from c:usersavkolgccincludec++10.2.0iostream:38,
  2055.                  from test.cpp:1:
  2056. c:usersavkolgccincludec++10.2.0x86_64-w64-mingw32bitsc++config.h:260:26: note: 'std::size_t' declared here
  2057.   260 |   typedef __SIZE_TYPE__  size_t;
  2058.       |                          ^~~~~~
  2059. In file included from c:usersavkolgccincludec++10.2.0extstring_conversions.h:41,
  2060.                  from c:usersavkolgccincludec++10.2.0bitsbasic_string.h:6535,
  2061.                  from c:usersavkolgccincludec++10.2.0string:55,
  2062.                  from c:usersavkolgccincludec++10.2.0bitslocale_classes.h:40,
  2063.                  from c:usersavkolgccincludec++10.2.0bitsios_base.h:41,
  2064.                  from c:usersavkolgccincludec++10.2.0ios:42,
  2065.                  from c:usersavkolgccincludec++10.2.0ostream:38,
  2066.                  from c:usersavkolgccincludec++10.2.0iostream:39,
  2067.                  from test.cpp:1:
  2068. c:usersavkolgccincludec++10.2.0cstdlib: At global scope:
  2069. c:usersavkolgccincludec++10.2.0cstdlib:154:11: error: 'mbstowcs' has not been declared in '::'
  2070.   154 |   using ::mbstowcs;
  2071.       |           ^~~~~~~~
  2072. c:usersavkolgccincludec++10.2.0cstdlib:171:11: error: 'wcstombs' has not been declared in '::'
  2073.   171 |   using ::wcstombs;
  2074.       |           ^~~~~~~~
  2075. c:usersavkolgccincludec++10.2.0cstdlib: In function 'lldiv_t __gnu_cxx::div(long long int, long long int)':
  2076. c:usersavkolgccincludec++10.2.0cstdlib:214:22: error: 'struct lldiv_t' has no member named 'quot'
  2077.   214 |   { lldiv_t __q; __q.quot = __n / __d; __q.rem = __n % __d; return __q; }
  2078.       |                      ^~~~
  2079. c:usersavkolgccincludec++10.2.0cstdlib:214:44: error: 'struct lldiv_t' has no member named 'rem'
  2080.   214 |   { lldiv_t __q; __q.quot = __n / __d; __q.rem = __n % __d; return __q; }
  2081.       |                                            ^~~
  2082. In file included from c:usersavkolgccincludec++10.2.0cstdio:42,
  2083.                  from c:usersavkolgccincludec++10.2.0extstring_conversions.h:43,
  2084.                  from c:usersavkolgccincludec++10.2.0bitsbasic_string.h:6535,
  2085.                  from c:usersavkolgccincludec++10.2.0string:55,
  2086.                  from c:usersavkolgccincludec++10.2.0bitslocale_classes.h:40,
  2087.                  from c:usersavkolgccincludec++10.2.0bitsios_base.h:41,
  2088.                  from c:usersavkolgccincludec++10.2.0ios:42,
  2089.                  from c:usersavkolgccincludec++10.2.0ostream:38,
  2090.                  from c:usersavkolgccincludec++10.2.0iostream:39,
  2091.                  from test.cpp:1:
  2092. C:MinGWinclude/stdio.h: At global scope:
  2093. C:MinGWinclude/stdio.h:295:71: error: 'size_t' has not been declared
  2094.   295 | _CRTIMP __cdecl __MINGW_NOTHROW  int    setvbuf (FILE *, char *, int, size_t);
  2095.       |                                                                       ^~~~~~
  2096. C:MinGWinclude/stdio.h:345:54: error: 'size_t' has not been declared
  2097.   345 | extern int __mingw_stdio_redirect__(snprintf)(char*, size_t, const char*, ...);
  2098.       |                                                      ^~~~~~
  2099. C:MinGWinclude/stdio.h:349:55: error: 'size_t' has not been declared
  2100.   349 | extern int __mingw_stdio_redirect__(vsnprintf)(char*, size_t, const char*, __VALIST);
  2101.       |                                                       ^~~~~~
  2102. C:MinGWinclude/stdio.h:480:28: error: 'size_t' has not been declared
  2103.   480 | int snprintf (char *__buf, size_t __len, const char *__format, ...)
  2104.       |                            ^~~~~~
  2105. C:MinGWinclude/stdio.h:490:29: error: 'size_t' has not been declared
  2106.   490 | int vsnprintf (char *__buf, size_t __len, const char *__format, __VALIST __local_argv)
  2107.       |                             ^~~~~~
  2108. C:MinGWinclude/stdio.h:525:57: error: 'size_t' has not been declared
  2109.   525 | _CRTIMP __cdecl __MINGW_NOTHROW  int _snprintf (char *, size_t, const char *, ...);
  2110.       |                                                         ^~~~~~
  2111. C:MinGWinclude/stdio.h:526:58: error: 'size_t' has not been declared
  2112.   526 | _CRTIMP __cdecl __MINGW_NOTHROW  int _vsnprintf (char *, size_t, const char *, __VALIST);
  2113.       |                                                          ^~~~~~
  2114. C:MinGWinclude/stdio.h:537:23: error: 'size_t' has not been declared
  2115.   537 | int snprintf (char *, size_t, const char *, ...);
  2116.       |                       ^~~~~~
  2117. C:MinGWinclude/stdio.h:540:24: error: 'size_t' has not been declared
  2118.   540 | int vsnprintf (char *, size_t, const char *, __VALIST);
  2119.       |                        ^~~~~~
  2120. C:MinGWinclude/stdio.h:680:33: error: 'size_t' has not been declared
  2121.   680 | getdelim (char ** __restrict__, size_t * __restrict__, int, FILE * __restrict__);
  2122.       |                                 ^~~~~~
  2123. C:MinGWinclude/stdio.h:683:32: error: 'size_t' has not been declared
  2124.   683 | getline (char ** __restrict__, size_t * __restrict__, FILE * __restrict__);
  2125.       |                                ^~~~~~
  2126. C:MinGWinclude/stdio.h:767:34: error: 'size_t' does not name a type
  2127.   767 | _CRTIMP __cdecl __MINGW_NOTHROW  size_t fread (void *, size_t, size_t, FILE *);
  2128.       |                                  ^~~~~~
  2129. C:MinGWinclude/stdio.h:69:1: note: 'size_t' is defined in header '<cstddef>'; did you forget to '#include <cstddef>'?
  2130.    68 | #include <stddef.h>
  2131.   +++ |+#include <cstddef>
  2132.    69 |
  2133. C:MinGWinclude/stdio.h:768:34: error: 'size_t' does not name a type
  2134.   768 | _CRTIMP __cdecl __MINGW_NOTHROW  size_t fwrite (const void *, size_t, size_t, FILE *);
  2135.       |                                  ^~~~~~
  2136. C:MinGWinclude/stdio.h:768:34: note: 'size_t' is defined in header '<cstddef>'; did you forget to '#include <cstddef>'?
  2137. In file included from c:usersavkolgccincludec++10.2.0extstring_conversions.h:43,
  2138.                  from c:usersavkolgccincludec++10.2.0bitsbasic_string.h:6535,
  2139.                  from c:usersavkolgccincludec++10.2.0string:55,
  2140.                  from c:usersavkolgccincludec++10.2.0bitslocale_classes.h:40,
  2141.                  from c:usersavkolgccincludec++10.2.0bitsios_base.h:41,
  2142.                  from c:usersavkolgccincludec++10.2.0ios:42,
  2143.                  from c:usersavkolgccincludec++10.2.0ostream:38,
  2144.                  from c:usersavkolgccincludec++10.2.0iostream:39,
  2145.                  from test.cpp:1:
  2146. c:usersavkolgccincludec++10.2.0cstdio:113:11: error: 'fread' has not been declared in '::'
  2147.   113 |   using ::fread;
  2148.       |           ^~~~~
  2149. c:usersavkolgccincludec++10.2.0cstdio:119:11: error: 'fwrite' has not been declared in '::'
  2150.   119 |   using ::fwrite;
  2151.       |           ^~~~~~
  2152. In file included from c:usersavkolgccincludec++10.2.0string:55,
  2153.                  from c:usersavkolgccincludec++10.2.0bitslocale_classes.h:40,
  2154.                  from c:usersavkolgccincludec++10.2.0bitsios_base.h:41,
  2155.                  from c:usersavkolgccincludec++10.2.0ios:42,
  2156.                  from c:usersavkolgccincludec++10.2.0ostream:38,
  2157.                  from c:usersavkolgccincludec++10.2.0iostream:39,
  2158.                  from test.cpp:1:
  2159. c:usersavkolgccincludec++10.2.0bitsbasic_string.h: In function 'std::string std::__cxx11::to_string(float)':
  2160. c:usersavkolgccincludec++10.2.0bitsbasic_string.h:6653:20: error: no matching function for call to '__to_xstring<std::string>(int (*)(char*, int, const char*, char*), const int&, const char [3], float&)'
  2161.  6653 |         "%f", __val);
  2162.       |                    ^
  2163. In file included from c:usersavkolgccincludec++10.2.0bitsbasic_string.h:6535,
  2164.                  from c:usersavkolgccincludec++10.2.0string:55,
  2165.                  from c:usersavkolgccincludec++10.2.0bitslocale_classes.h:40,
  2166.                  from c:usersavkolgccincludec++10.2.0bitsios_base.h:41,
  2167.                  from c:usersavkolgccincludec++10.2.0ios:42,
  2168.                  from c:usersavkolgccincludec++10.2.0ostream:38,
  2169.                  from c:usersavkolgccincludec++10.2.0iostream:39,
  2170.                  from test.cpp:1:
  2171. c:usersavkolgccincludec++10.2.0extstring_conversions.h:99:5: note: candidate: 'template<class _String, class _CharT> _String __gnu_cxx::__to_xstring(int (*)(_CharT*, std::size_t, const _CharT*, char*), std::size_t, const _CharT*, ...)'
  2172.    99 |     __to_xstring(int (*__convf) (_CharT*, std::size_t, const _CharT*,
  2173.       |     ^~~~~~~~~~~~
  2174. c:usersavkolgccincludec++10.2.0extstring_conversions.h:99:5: note:   template argument deduction/substitution failed:
  2175. In file included from c:usersavkolgccincludec++10.2.0string:55,
  2176.                  from c:usersavkolgccincludec++10.2.0bitslocale_classes.h:40,
  2177.                  from c:usersavkolgccincludec++10.2.0bitsios_base.h:41,
  2178.                  from c:usersavkolgccincludec++10.2.0ios:42,
  2179.                  from c:usersavkolgccincludec++10.2.0ostream:38,
  2180.                  from c:usersavkolgccincludec++10.2.0iostream:39,
  2181.                  from test.cpp:1:
  2182. c:usersavkolgccincludec++10.2.0bitsbasic_string.h:6653:20: note:   mismatched types 'std::size_t' {aka 'long long unsigned int'} and 'int'
  2183.  6653 |         "%f", __val);
  2184.       |                    ^
  2185. c:usersavkolgccincludec++10.2.0bitsbasic_string.h: In function 'std::string std::__cxx11::to_string(double)':
  2186. c:usersavkolgccincludec++10.2.0bitsbasic_string.h:6662:20: error: no matching function for call to '__to_xstring<std::string>(int (*)(char*, int, const char*, char*), const int&, const char [3], double&)'
  2187.  6662 |         "%f", __val);
  2188.       |                    ^
  2189. In file included from c:usersavkolgccincludec++10.2.0bitsbasic_string.h:6535,
  2190.                  from c:usersavkolgccincludec++10.2.0string:55,
  2191.                  from c:usersavkolgccincludec++10.2.0bitslocale_classes.h:40,
  2192.                  from c:usersavkolgccincludec++10.2.0bitsios_base.h:41,
  2193.                  from c:usersavkolgccincludec++10.2.0ios:42,
  2194.                  from c:usersavkolgccincludec++10.2.0ostream:38,
  2195.                  from c:usersavkolgccincludec++10.2.0iostream:39,
  2196.                  from test.cpp:1:
  2197. c:usersavkolgccincludec++10.2.0extstring_conversions.h:99:5: note: candidate: 'template<class _String, class _CharT> _String __gnu_cxx::__to_xstring(int (*)(_CharT*, std::size_t, const _CharT*, char*), std::size_t, const _CharT*, ...)'
  2198.    99 |     __to_xstring(int (*__convf) (_CharT*, std::size_t, const _CharT*,
  2199.       |     ^~~~~~~~~~~~
  2200. c:usersavkolgccincludec++10.2.0extstring_conversions.h:99:5: note:   template argument deduction/substitution failed:
  2201. In file included from c:usersavkolgccincludec++10.2.0string:55,
  2202.                  from c:usersavkolgccincludec++10.2.0bitslocale_classes.h:40,
  2203.                  from c:usersavkolgccincludec++10.2.0bitsios_base.h:41,
  2204.                  from c:usersavkolgccincludec++10.2.0ios:42,
  2205.                  from c:usersavkolgccincludec++10.2.0ostream:38,
  2206.                  from c:usersavkolgccincludec++10.2.0iostream:39,
  2207.                  from test.cpp:1:
  2208. c:usersavkolgccincludec++10.2.0bitsbasic_string.h:6662:20: note:   mismatched types 'std::size_t' {aka 'long long unsigned int'} and 'int'
  2209.  6662 |         "%f", __val);
  2210.       |                    ^
  2211. c:usersavkolgccincludec++10.2.0bitsbasic_string.h: In function 'std::string std::__cxx11::to_string(long double)':
  2212. c:usersavkolgccincludec++10.2.0bitsbasic_string.h:6671:21: error: no matching function for call to '__to_xstring<std::string>(int (*)(char*, int, const char*, char*), const int&, const char [4], long double&)'
  2213.  6671 |         "%Lf", __val);
  2214.       |                     ^
  2215. In file included from c:usersavkolgccincludec++10.2.0bitsbasic_string.h:6535,
  2216.                  from c:usersavkolgccincludec++10.2.0string:55,
  2217.                  from c:usersavkolgccincludec++10.2.0bitslocale_classes.h:40,
  2218.                  from c:usersavkolgccincludec++10.2.0bitsios_base.h:41,
  2219.                  from c:usersavkolgccincludec++10.2.0ios:42,
  2220.                  from c:usersavkolgccincludec++10.2.0ostream:38,
  2221.                  from c:usersavkolgccincludec++10.2.0iostream:39,
  2222.                  from test.cpp:1:
  2223. c:usersavkolgccincludec++10.2.0extstring_conversions.h:99:5: note: candidate: 'template<class _String, class _CharT> _String __gnu_cxx::__to_xstring(int (*)(_CharT*, std::size_t, const _CharT*, char*), std::size_t, const _CharT*, ...)'
  2224.    99 |     __to_xstring(int (*__convf) (_CharT*, std::size_t, const _CharT*,
  2225.       |     ^~~~~~~~~~~~
  2226. c:usersavkolgccincludec++10.2.0extstring_conversions.h:99:5: note:   template argument deduction/substitution failed:
  2227. In file included from c:usersavkolgccincludec++10.2.0string:55,
  2228.                  from c:usersavkolgccincludec++10.2.0bitslocale_classes.h:40,
  2229.                  from c:usersavkolgccincludec++10.2.0bitsios_base.h:41,
  2230.                  from c:usersavkolgccincludec++10.2.0ios:42,
  2231.                  from c:usersavkolgccincludec++10.2.0ostream:38,
  2232.                  from c:usersavkolgccincludec++10.2.0iostream:39,
  2233.                  from test.cpp:1:
  2234. c:usersavkolgccincludec++10.2.0bitsbasic_string.h:6671:21: note:   mismatched types 'std::size_t' {aka 'long long unsigned int'} and 'int'
  2235.  6671 |         "%Lf", __val);
  2236.       |                     ^
  2237. c:usersavkolgccincludec++10.2.0bitsbasic_string.h: In function 'std::wstring std::__cxx11::to_wstring(int)':
  2238. c:usersavkolgccincludec++10.2.0bitsbasic_string.h:6719:22: error: no matching function for call to '__to_xstring<std::wstring>(int (*)(wchar_t*, const wchar_t*, char*), long long unsigned int, const wchar_t [3], int&)'
  2239.  6719 |          L"%d", __val); }
  2240.       |                      ^
  2241. In file included from c:usersavkolgccincludec++10.2.0bitsbasic_string.h:6535,
  2242.                  from c:usersavkolgccincludec++10.2.0string:55,
  2243.                  from c:usersavkolgccincludec++10.2.0bitslocale_classes.h:40,
  2244.                  from c:usersavkolgccincludec++10.2.0bitsios_base.h:41,
  2245.                  from c:usersavkolgccincludec++10.2.0ios:42,
  2246.                  from c:usersavkolgccincludec++10.2.0ostream:38,
  2247.                  from c:usersavkolgccincludec++10.2.0iostream:39,
  2248.                  from test.cpp:1:
  2249. c:usersavkolgccincludec++10.2.0extstring_conversions.h:99:5: note: candidate: 'template<class _String, class _CharT> _String __gnu_cxx::__to_xstring(int (*)(_CharT*, std::size_t, const _CharT*, char*), std::size_t, const _CharT*, ...)'
  2250.    99 |     __to_xstring(int (*__convf) (_CharT*, std::size_t, const _CharT*,
  2251.       |     ^~~~~~~~~~~~
  2252. c:usersavkolgccincludec++10.2.0extstring_conversions.h:99:5: note:   template argument deduction/substitution failed:
  2253. In file included from c:usersavkolgccincludec++10.2.0string:55,
  2254.                  from c:usersavkolgccincludec++10.2.0bitslocale_classes.h:40,
  2255.                  from c:usersavkolgccincludec++10.2.0bitsios_base.h:41,
  2256.                  from c:usersavkolgccincludec++10.2.0ios:42,
  2257.                  from c:usersavkolgccincludec++10.2.0ostream:38,
  2258.                  from c:usersavkolgccincludec++10.2.0iostream:39,
  2259.                  from test.cpp:1:
  2260. c:usersavkolgccincludec++10.2.0bitsbasic_string.h:6719:22: note:   mismatched types 'std::size_t' {aka 'long long unsigned int'} and 'const wchar_t*'
  2261.  6719 |          L"%d", __val); }
  2262.       |                      ^
  2263. c:usersavkolgccincludec++10.2.0bitsbasic_string.h: In function 'std::wstring std::__cxx11::to_wstring(unsigned int)':
  2264. c:usersavkolgccincludec++10.2.0bitsbasic_string.h:6725:22: error: no matching function for call to '__to_xstring<std::wstring>(int (*)(wchar_t*, const wchar_t*, char*), long long unsigned int, const wchar_t [3], unsigned int&)'
  2265.  6725 |          L"%u", __val); }
  2266.       |                      ^
  2267. In file included from c:usersavkolgccincludec++10.2.0bitsbasic_string.h:6535,
  2268.                  from c:usersavkolgccincludec++10.2.0string:55,
  2269.                  from c:usersavkolgccincludec++10.2.0bitslocale_classes.h:40,
  2270.                  from c:usersavkolgccincludec++10.2.0bitsios_base.h:41,
  2271.                  from c:usersavkolgccincludec++10.2.0ios:42,
  2272.                  from c:usersavkolgccincludec++10.2.0ostream:38,
  2273.                  from c:usersavkolgccincludec++10.2.0iostream:39,
  2274.                  from test.cpp:1:
  2275. c:usersavkolgccincludec++10.2.0extstring_conversions.h:99:5: note: candidate: 'template<class _String, class _CharT> _String __gnu_cxx::__to_xstring(int (*)(_CharT*, std::size_t, const _CharT*, char*), std::size_t, const _CharT*, ...)'
  2276.    99 |     __to_xstring(int (*__convf) (_CharT*, std::size_t, const _CharT*,
  2277.       |     ^~~~~~~~~~~~
  2278. c:usersavkolgccincludec++10.2.0extstring_conversions.h:99:5: note:   template argument deduction/substitution failed:
  2279. In file included from c:usersavkolgccincludec++10.2.0string:55,
  2280.                  from c:usersavkolgccincludec++10.2.0bitslocale_classes.h:40,
  2281.                  from c:usersavkolgccincludec++10.2.0bitsios_base.h:41,
  2282.                  from c:usersavkolgccincludec++10.2.0ios:42,
  2283.                  from c:usersavkolgccincludec++10.2.0ostream:38,
  2284.                  from c:usersavkolgccincludec++10.2.0iostream:39,
  2285.                  from test.cpp:1:
  2286. c:usersavkolgccincludec++10.2.0bitsbasic_string.h:6725:22: note:   mismatched types 'std::size_t' {aka 'long long unsigned int'} and 'const wchar_t*'
  2287.  6725 |          L"%u", __val); }
  2288.       |                      ^
  2289. c:usersavkolgccincludec++10.2.0bitsbasic_string.h: In function 'std::wstring std::__cxx11::to_wstring(long int)':
  2290. c:usersavkolgccincludec++10.2.0bitsbasic_string.h:6730:23: error: no matching function for call to '__to_xstring<std::wstring>(int (*)(wchar_t*, const wchar_t*, char*), long long unsigned int, const wchar_t [4], long int&)'
  2291.  6730 |          L"%ld", __val); }
  2292.       |                       ^
  2293. In file included from c:usersavkolgccincludec++10.2.0bitsbasic_string.h:6535,
  2294.                  from c:usersavkolgccincludec++10.2.0string:55,
  2295.                  from c:usersavkolgccincludec++10.2.0bitslocale_classes.h:40,
  2296.                  from c:usersavkolgccincludec++10.2.0bitsios_base.h:41,
  2297.                  from c:usersavkolgccincludec++10.2.0ios:42,
  2298.                  from c:usersavkolgccincludec++10.2.0ostream:38,
  2299.                  from c:usersavkolgccincludec++10.2.0iostream:39,
  2300.                  from test.cpp:1:
  2301. c:usersavkolgccincludec++10.2.0extstring_conversions.h:99:5: note: candidate: 'template<class _String, class _CharT> _String __gnu_cxx::__to_xstring(int (*)(_CharT*, std::size_t, const _CharT*, char*), std::size_t, const _CharT*, ...)'
  2302.    99 |     __to_xstring(int (*__convf) (_CharT*, std::size_t, const _CharT*,
  2303.       |     ^~~~~~~~~~~~
  2304. c:usersavkolgccincludec++10.2.0extstring_conversions.h:99:5: note:   template argument deduction/substitution failed:
  2305. In file included from c:usersavkolgccincludec++10.2.0string:55,
  2306.                  from c:usersavkolgccincludec++10.2.0bitslocale_classes.h:40,
  2307.                  from c:usersavkolgccincludec++10.2.0bitsios_base.h:41,
  2308.                  from c:usersavkolgccincludec++10.2.0ios:42,
  2309.                  from c:usersavkolgccincludec++10.2.0ostream:38,
  2310.                  from c:usersavkolgccincludec++10.2.0iostream:39,
  2311.                  from test.cpp:1:
  2312. c:usersavkolgccincludec++10.2.0bitsbasic_string.h:6730:23: note:   mismatched types 'std::size_t' {aka 'long long unsigned int'} and 'const wchar_t*'
  2313.  6730 |          L"%ld", __val); }
  2314.       |                       ^
  2315. c:usersavkolgccincludec++10.2.0bitsbasic_string.h: In function 'std::wstring std::__cxx11::to_wstring(long unsigned int)':
  2316. c:usersavkolgccincludec++10.2.0bitsbasic_string.h:6736:23: error: no matching function for call to '__to_xstring<std::wstring>(int (*)(wchar_t*, const wchar_t*, char*), long long unsigned int, const wchar_t [4], long unsigned int&)'
  2317.  6736 |          L"%lu", __val); }
  2318.       |                       ^
  2319. In file included from c:usersavkolgccincludec++10.2.0bitsbasic_string.h:6535,
  2320.                  from c:usersavkolgccincludec++10.2.0string:55,
  2321.                  from c:usersavkolgccincludec++10.2.0bitslocale_classes.h:40,
  2322.                  from c:usersavkolgccincludec++10.2.0bitsios_base.h:41,
  2323.                  from c:usersavkolgccincludec++10.2.0ios:42,
  2324.                  from c:usersavkolgccincludec++10.2.0ostream:38,
  2325.                  from c:usersavkolgccincludec++10.2.0iostream:39,
  2326.                  from test.cpp:1:
  2327. c:usersavkolgccincludec++10.2.0extstring_conversions.h:99:5: note: candidate: 'template<class _String, class _CharT> _String __gnu_cxx::__to_xstring(int (*)(_CharT*, std::size_t, const _CharT*, char*), std::size_t, const _CharT*, ...)'
  2328.    99 |     __to_xstring(int (*__convf) (_CharT*, std::size_t, const _CharT*,
  2329.       |     ^~~~~~~~~~~~
  2330. c:usersavkolgccincludec++10.2.0extstring_conversions.h:99:5: note:   template argument deduction/substitution failed:
  2331. In file included from c:usersavkolgccincludec++10.2.0string:55,
  2332.                  from c:usersavkolgccincludec++10.2.0bitslocale_classes.h:40,
  2333.                  from c:usersavkolgccincludec++10.2.0bitsios_base.h:41,
  2334.                  from c:usersavkolgccincludec++10.2.0ios:42,
  2335.                  from c:usersavkolgccincludec++10.2.0ostream:38,
  2336.                  from c:usersavkolgccincludec++10.2.0iostream:39,
  2337.                  from test.cpp:1:
  2338. c:usersavkolgccincludec++10.2.0bitsbasic_string.h:6736:23: note:   mismatched types 'std::size_t' {aka 'long long unsigned int'} and 'const wchar_t*'
  2339.  6736 |          L"%lu", __val); }
  2340.       |                       ^
  2341. c:usersavkolgccincludec++10.2.0bitsbasic_string.h: In function 'std::wstring std::__cxx11::to_wstring(long long int)':
  2342. c:usersavkolgccincludec++10.2.0bitsbasic_string.h:6742:24: error: no matching function for call to '__to_xstring<std::wstring>(int (*)(wchar_t*, const wchar_t*, char*), long long unsigned int, const wchar_t [5], long long int&)'
  2343.  6742 |          L"%lld", __val); }
  2344.       |                        ^
  2345. In file included from c:usersavkolgccincludec++10.2.0bitsbasic_string.h:6535,
  2346.                  from c:usersavkolgccincludec++10.2.0string:55,
  2347.                  from c:usersavkolgccincludec++10.2.0bitslocale_classes.h:40,
  2348.                  from c:usersavkolgccincludec++10.2.0bitsios_base.h:41,
  2349.                  from c:usersavkolgccincludec++10.2.0ios:42,
  2350.                  from c:usersavkolgccincludec++10.2.0ostream:38,
  2351.                  from c:usersavkolgccincludec++10.2.0iostream:39,
  2352.                  from test.cpp:1:
  2353. c:usersavkolgccincludec++10.2.0extstring_conversions.h:99:5: note: candidate: 'template<class _String, class _CharT> _String __gnu_cxx::__to_xstring(int (*)(_CharT*, std::size_t, const _CharT*, char*), std::size_t, const _CharT*, ...)'
  2354.    99 |     __to_xstring(int (*__convf) (_CharT*, std::size_t, const _CharT*,
  2355.       |     ^~~~~~~~~~~~
  2356. c:usersavkolgccincludec++10.2.0extstring_conversions.h:99:5: note:   template argument deduction/substitution failed:
  2357. In file included from c:usersavkolgccincludec++10.2.0string:55,
  2358.                  from c:usersavkolgccincludec++10.2.0bitslocale_classes.h:40,
  2359.                  from c:usersavkolgccincludec++10.2.0bitsios_base.h:41,
  2360.                  from c:usersavkolgccincludec++10.2.0ios:42,
  2361.                  from c:usersavkolgccincludec++10.2.0ostream:38,
  2362.                  from c:usersavkolgccincludec++10.2.0iostream:39,
  2363.                  from test.cpp:1:
  2364. c:usersavkolgccincludec++10.2.0bitsbasic_string.h:6742:24: note:   mismatched types 'std::size_t' {aka 'long long unsigned int'} and 'const wchar_t*'
  2365.  6742 |          L"%lld", __val); }
  2366.       |                        ^
  2367. c:usersavkolgccincludec++10.2.0bitsbasic_string.h: In function 'std::wstring std::__cxx11::to_wstring(long long unsigned int)':
  2368. c:usersavkolgccincludec++10.2.0bitsbasic_string.h:6748:24: error: no matching function for call to '__to_xstring<std::wstring>(int (*)(wchar_t*, const wchar_t*, char*), long long unsigned int, const wchar_t [5], long long unsigned int&)'
  2369.  6748 |          L"%llu", __val); }
  2370.       |                        ^
  2371. In file included from c:usersavkolgccincludec++10.2.0bitsbasic_string.h:6535,
  2372.                  from c:usersavkolgccincludec++10.2.0string:55,
  2373.                  from c:usersavkolgccincludec++10.2.0bitslocale_classes.h:40,
  2374.                  from c:usersavkolgccincludec++10.2.0bitsios_base.h:41,
  2375.                  from c:usersavkolgccincludec++10.2.0ios:42,
  2376.                  from c:usersavkolgccincludec++10.2.0ostream:38,
  2377.                  from c:usersavkolgccincludec++10.2.0iostream:39,
  2378.                  from test.cpp:1:
  2379. c:usersavkolgccincludec++10.2.0extstring_conversions.h:99:5: note: candidate: 'template<class _String, class _CharT> _String __gnu_cxx::__to_xstring(int (*)(_CharT*, std::size_t, const _CharT*, char*), std::size_t, const _CharT*, ...)'
  2380.    99 |     __to_xstring(int (*__convf) (_CharT*, std::size_t, const _CharT*,
  2381.       |     ^~~~~~~~~~~~
  2382. c:usersavkolgccincludec++10.2.0extstring_conversions.h:99:5: note:   template argument deduction/substitution failed:
  2383. In file included from c:usersavkolgccincludec++10.2.0string:55,
  2384.                  from c:usersavkolgccincludec++10.2.0bitslocale_classes.h:40,
  2385.                  from c:usersavkolgccincludec++10.2.0bitsios_base.h:41,
  2386.                  from c:usersavkolgccincludec++10.2.0ios:42,
  2387.                  from c:usersavkolgccincludec++10.2.0ostream:38,
  2388.                  from c:usersavkolgccincludec++10.2.0iostream:39,
  2389.                  from test.cpp:1:
  2390. c:usersavkolgccincludec++10.2.0bitsbasic_string.h:6748:24: note:   mismatched types 'std::size_t' {aka 'long long unsigned int'} and 'const wchar_t*'
  2391.  6748 |          L"%llu", __val); }
  2392.       |                        ^
  2393. c:usersavkolgccincludec++10.2.0bitsbasic_string.h: In function 'std::wstring std::__cxx11::to_wstring(float)':
  2394. c:usersavkolgccincludec++10.2.0bitsbasic_string.h:6756:22: error: no matching function for call to '__to_xstring<std::wstring>(int (*)(wchar_t*, const wchar_t*, char*), const int&, const wchar_t [3], float&)'
  2395.  6756 |          L"%f", __val);
  2396.       |                      ^
  2397. In file included from c:usersavkolgccincludec++10.2.0bitsbasic_string.h:6535,
  2398.                  from c:usersavkolgccincludec++10.2.0string:55,
  2399.                  from c:usersavkolgccincludec++10.2.0bitslocale_classes.h:40,
  2400.                  from c:usersavkolgccincludec++10.2.0bitsios_base.h:41,
  2401.                  from c:usersavkolgccincludec++10.2.0ios:42,
  2402.                  from c:usersavkolgccincludec++10.2.0ostream:38,
  2403.                  from c:usersavkolgccincludec++10.2.0iostream:39,
  2404.                  from test.cpp:1:
  2405. c:usersavkolgccincludec++10.2.0extstring_conversions.h:99:5: note: candidate: 'template<class _String, class _CharT> _String __gnu_cxx::__to_xstring(int (*)(_CharT*, std::size_t, const _CharT*, char*), std::size_t, const _CharT*, ...)'
  2406.    99 |     __to_xstring(int (*__convf) (_CharT*, std::size_t, const _CharT*,
  2407.       |     ^~~~~~~~~~~~
  2408. c:usersavkolgccincludec++10.2.0extstring_conversions.h:99:5: note:   template argument deduction/substitution failed:
  2409. In file included from c:usersavkolgccincludec++10.2.0string:55,
  2410.                  from c:usersavkolgccincludec++10.2.0bitslocale_classes.h:40,
  2411.                  from c:usersavkolgccincludec++10.2.0bitsios_base.h:41,
  2412.                  from c:usersavkolgccincludec++10.2.0ios:42,
  2413.                  from c:usersavkolgccincludec++10.2.0ostream:38,
  2414.                  from c:usersavkolgccincludec++10.2.0iostream:39,
  2415.                  from test.cpp:1:
  2416. c:usersavkolgccincludec++10.2.0bitsbasic_string.h:6756:22: note:   mismatched types 'std::size_t' {aka 'long long unsigned int'} and 'const wchar_t*'
  2417.  6756 |          L"%f", __val);
  2418.       |                      ^
  2419. c:usersavkolgccincludec++10.2.0bitsbasic_string.h: In function 'std::wstring std::__cxx11::to_wstring(double)':
  2420. c:usersavkolgccincludec++10.2.0bitsbasic_string.h:6765:22: error: no matching function for call to '__to_xstring<std::wstring>(int (*)(wchar_t*, const wchar_t*, char*), const int&, const wchar_t [3], double&)'
  2421.  6765 |          L"%f", __val);
  2422.       |                      ^
  2423. In file included from c:usersavkolgccincludec++10.2.0bitsbasic_string.h:6535,
  2424.                  from c:usersavkolgccincludec++10.2.0string:55,
  2425.                  from c:usersavkolgccincludec++10.2.0bitslocale_classes.h:40,
  2426.                  from c:usersavkolgccincludec++10.2.0bitsios_base.h:41,
  2427.                  from c:usersavkolgccincludec++10.2.0ios:42,
  2428.                  from c:usersavkolgccincludec++10.2.0ostream:38,
  2429.                  from c:usersavkolgccincludec++10.2.0iostream:39,
  2430.                  from test.cpp:1:
  2431. c:usersavkolgccincludec++10.2.0extstring_conversions.h:99:5: note: candidate: 'template<class _String, class _CharT> _String __gnu_cxx::__to_xstring(int (*)(_CharT*, std::size_t, const _CharT*, char*), std::size_t, const _CharT*, ...)'
  2432.    99 |     __to_xstring(int (*__convf) (_CharT*, std::size_t, const _CharT*,
  2433.       |     ^~~~~~~~~~~~
  2434. c:usersavkolgccincludec++10.2.0extstring_conversions.h:99:5: note:   template argument deduction/substitution failed:
  2435. In file included from c:usersavkolgccincludec++10.2.0string:55,
  2436.                  from c:usersavkolgccincludec++10.2.0bitslocale_classes.h:40,
  2437.                  from c:usersavkolgccincludec++10.2.0bitsios_base.h:41,
  2438.                  from c:usersavkolgccincludec++10.2.0ios:42,
  2439.                  from c:usersavkolgccincludec++10.2.0ostream:38,
  2440.                  from c:usersavkolgccincludec++10.2.0iostream:39,
  2441.                  from test.cpp:1:
  2442. c:usersavkolgccincludec++10.2.0bitsbasic_string.h:6765:22: note:   mismatched types 'std::size_t' {aka 'long long unsigned int'} and 'const wchar_t*'
  2443.  6765 |          L"%f", __val);
  2444.       |                      ^
  2445. c:usersavkolgccincludec++10.2.0bitsbasic_string.h: In function 'std::wstring std::__cxx11::to_wstring(long double)':
  2446. c:usersavkolgccincludec++10.2.0bitsbasic_string.h:6774:23: error: no matching function for call to '__to_xstring<std::wstring>(int (*)(wchar_t*, const wchar_t*, char*), const int&, const wchar_t [4], long double&)'
  2447.  6774 |          L"%Lf", __val);
  2448.       |                       ^
  2449. In file included from c:usersavkolgccincludec++10.2.0bitsbasic_string.h:6535,
  2450.                  from c:usersavkolgccincludec++10.2.0string:55,
  2451.                  from c:usersavkolgccincludec++10.2.0bitslocale_classes.h:40,
  2452.                  from c:usersavkolgccincludec++10.2.0bitsios_base.h:41,
  2453.                  from c:usersavkolgccincludec++10.2.0ios:42,
  2454.                  from c:usersavkolgccincludec++10.2.0ostream:38,
  2455.                  from c:usersavkolgccincludec++10.2.0iostream:39,
  2456.                  from test.cpp:1:
  2457. c:usersavkolgccincludec++10.2.0extstring_conversions.h:99:5: note: candidate: 'template<class _String, class _CharT> _String __gnu_cxx::__to_xstring(int (*)(_CharT*, std::size_t, const _CharT*, char*), std::size_t, const _CharT*, ...)'
  2458.    99 |     __to_xstring(int (*__convf) (_CharT*, std::size_t, const _CharT*,
  2459.       |     ^~~~~~~~~~~~
  2460. c:usersavkolgccincludec++10.2.0extstring_conversions.h:99:5: note:   template argument deduction/substitution failed:
  2461. In file included from c:usersavkolgccincludec++10.2.0string:55,
  2462.                  from c:usersavkolgccincludec++10.2.0bitslocale_classes.h:40,
  2463.                  from c:usersavkolgccincludec++10.2.0bitsios_base.h:41,
  2464.                  from c:usersavkolgccincludec++10.2.0ios:42,
  2465.                  from c:usersavkolgccincludec++10.2.0ostream:38,
  2466.                  from c:usersavkolgccincludec++10.2.0iostream:39,
  2467.                  from test.cpp:1:
  2468. c:usersavkolgccincludec++10.2.0bitsbasic_string.h:6774:23: note:   mismatched types 'std::size_t' {aka 'long long unsigned int'} and 'const wchar_t*'
  2469.  6774 |          L"%Lf", __val);
  2470.       |                       ^
  2471. In file included from c:usersavkolgccincludec++10.2.0system_error:39,
  2472.                  from c:usersavkolgccincludec++10.2.0bitsios_base.h:46,
  2473.                  from c:usersavkolgccincludec++10.2.0ios:42,
  2474.                  from c:usersavkolgccincludec++10.2.0ostream:38,
  2475.                  from c:usersavkolgccincludec++10.2.0iostream:39,
  2476.                  from test.cpp:1:
  2477. c:usersavkolgccincludec++10.2.0x86_64-w64-mingw32bitserror_constants.h: At global scope:
  2478. c:usersavkolgccincludec++10.2.0x86_64-w64-mingw32bitserror_constants.h:44:40: error: 'EAFNOSUPPORT' was not declared in this scope; did you mean 'WSAEAFNOSUPPORT'?
  2479.    44 |       address_family_not_supported =   EAFNOSUPPORT,
  2480.       |                                        ^~~~~~~~~~~~
  2481.       |                                        WSAEAFNOSUPPORT
  2482. c:usersavkolgccincludec++10.2.0x86_64-w64-mingw32bitserror_constants.h:45:28: error: 'EADDRINUSE' was not declared in this scope; did you mean 'WSAEADDRINUSE'?
  2483.    45 |       address_in_use =     EADDRINUSE,
  2484.       |                            ^~~~~~~~~~
  2485.       |                            WSAEADDRINUSE
  2486. c:usersavkolgccincludec++10.2.0x86_64-w64-mingw32bitserror_constants.h:46:34: error: 'EADDRNOTAVAIL' was not declared in this scope; did you mean 'WSAEADDRNOTAVAIL'?
  2487.    46 |       address_not_available =    EADDRNOTAVAIL,
  2488.       |                                  ^~~~~~~~~~~~~
  2489.       |                                  WSAEADDRNOTAVAIL
  2490. c:usersavkolgccincludec++10.2.0x86_64-w64-mingw32bitserror_constants.h:47:30: error: 'EISCONN' was not declared in this scope; did you mean 'WSAEISCONN'?
  2491.    47 |       already_connected =    EISCONN,
  2492.       |                              ^~~~~~~
  2493.       |                              WSAEISCONN
  2494. c:usersavkolgccincludec++10.2.0x86_64-w64-mingw32bitserror_constants.h:56:31: error: 'ECONNABORTED' was not declared in this scope; did you mean 'WSAECONNABORTED'?
  2495.    56 |       connection_aborted =    ECONNABORTED,
  2496.       |                               ^~~~~~~~~~~~
  2497.       |                               WSAECONNABORTED
  2498. c:usersavkolgccincludec++10.2.0x86_64-w64-mingw32bitserror_constants.h:57:42: error: 'EALREADY' was not declared in this scope; did you mean 'WSAEALREADY'?
  2499.    57 |       connection_already_in_progress =   EALREADY,
  2500.       |                                          ^~~~~~~~
  2501.       |                                          WSAEALREADY
  2502. c:usersavkolgccincludec++10.2.0x86_64-w64-mingw32bitserror_constants.h:58:31: error: 'ECONNREFUSED' was not declared in this scope; did you mean 'WSAECONNREFUSED'?
  2503.    58 |       connection_refused =    ECONNREFUSED,
  2504.       |                               ^~~~~~~~~~~~
  2505.       |                               WSAECONNREFUSED
  2506. c:usersavkolgccincludec++10.2.0x86_64-w64-mingw32bitserror_constants.h:59:29: error: 'ECONNRESET' was not declared in this scope; did you mean 'WSAECONNRESET'?
  2507.    59 |       connection_reset =    ECONNRESET,
  2508.       |                             ^~~~~~~~~~
  2509.       |                             WSAECONNRESET
  2510. c:usersavkolgccincludec++10.2.0x86_64-w64-mingw32bitserror_constants.h:61:40: error: 'EDESTADDRREQ' was not declared in this scope; did you mean 'WSAEDESTADDRREQ'?
  2511.    61 |       destination_address_required =   EDESTADDRREQ,
  2512.       |                                        ^~~~~~~~~~~~
  2513.       |                                        WSAEDESTADDRREQ
  2514. c:usersavkolgccincludec++10.2.0x86_64-w64-mingw32bitserror_constants.h:69:29: error: 'EHOSTUNREACH' was not declared in this scope; did you mean 'WSAEHOSTUNREACH'?
  2515.    69 |       host_unreachable =    EHOSTUNREACH,
  2516.       |                             ^~~~~~~~~~~~
  2517.       |                             WSAEHOSTUNREACH
  2518. c:usersavkolgccincludec++10.2.0x86_64-w64-mingw32bitserror_constants.h:80:26: error: 'EMSGSIZE' was not declared in this scope; did you mean 'WSAEMSGSIZE'?
  2519.    80 |       message_size =     EMSGSIZE,
  2520.       |                          ^~~~~~~~
  2521.       |                          WSAEMSGSIZE
  2522. c:usersavkolgccincludec++10.2.0x86_64-w64-mingw32bitserror_constants.h:81:26: error: 'ENETDOWN' was not declared in this scope; did you mean 'WSAENETDOWN'?
  2523.    81 |       network_down =     ENETDOWN,
  2524.       |                          ^~~~~~~~
  2525.       |                          WSAENETDOWN
  2526. c:usersavkolgccincludec++10.2.0x86_64-w64-mingw32bitserror_constants.h:82:27: error: 'ENETRESET' was not declared in this scope; did you mean 'WSAENETRESET'?
  2527.    82 |       network_reset =     ENETRESET,
  2528.       |                           ^~~~~~~~~
  2529.       |                           WSAENETRESET
  2530. c:usersavkolgccincludec++10.2.0x86_64-w64-mingw32bitserror_constants.h:83:32: error: 'ENETUNREACH' was not declared in this scope; did you mean 'WSAENETUNREACH'?
  2531.    83 |       network_unreachable =    ENETUNREACH,
  2532.       |                                ^~~~~~~~~~~
  2533.       |                                WSAENETUNREACH
  2534. c:usersavkolgccincludec++10.2.0x86_64-w64-mingw32bitserror_constants.h:84:28: error: 'ENOBUFS' was not declared in this scope; did you mean 'EROFS'?
  2535.    84 |       no_buffer_space =    ENOBUFS,
  2536.       |                            ^~~~~~~
  2537.       |                            EROFS
  2538. c:usersavkolgccincludec++10.2.0x86_64-w64-mingw32bitserror_constants.h:98:31: error: 'ENOPROTOOPT' was not declared in this scope; did you mean 'WSAENOPROTOOPT'?
  2539.    98 |       no_protocol_option =    ENOPROTOOPT,
  2540.       |                               ^~~~~~~~~~~
  2541.       |                               WSAENOPROTOOPT
  2542. c:usersavkolgccincludec++10.2.0x86_64-w64-mingw32bitserror_constants.h:110:26: error: 'ENOTSOCK' was not declared in this scope; did you mean 'WSAENOTSOCK'?
  2543.   110 |       not_a_socket =     ENOTSOCK,
  2544.       |                          ^~~~~~~~
  2545.       |                          WSAENOTSOCK
  2546. c:usersavkolgccincludec++10.2.0x86_64-w64-mingw32bitserror_constants.h:114:27: error: 'ENOTCONN' was not declared in this scope; did you mean 'WSAENOTCONN'?
  2547.   114 |       not_connected =     ENOTCONN,
  2548.       |                           ^~~~~~~~
  2549.       |                           WSAENOTCONN
  2550. c:usersavkolgccincludec++10.2.0x86_64-w64-mingw32bitserror_constants.h:117:27: error: 'ENOTSUP' was not declared in this scope
  2551.   117 |       not_supported =     ENOTSUP,
  2552.       |                           ^~~~~~~
  2553. c:usersavkolgccincludec++10.2.0x86_64-w64-mingw32bitserror_constants.h:119:31: error: 'ECANCELED' was not declared in this scope; did you mean 'WSAECANCELLED'?
  2554.   119 |       operation_canceled =    ECANCELED,
  2555.       |                               ^~~~~~~~~
  2556.       |                               WSAECANCELLED
  2557. c:usersavkolgccincludec++10.2.0x86_64-w64-mingw32bitserror_constants.h:120:34: error: 'EINPROGRESS' was not declared in this scope; did you mean 'WSAEINPROGRESS'?
  2558.   120 |       operation_in_progress =    EINPROGRESS,
  2559.       |                                  ^~~~~~~~~~~
  2560.       |                                  WSAEINPROGRESS
  2561. c:usersavkolgccincludec++10.2.0x86_64-w64-mingw32bitserror_constants.h:124:35: error: 'EOPNOTSUPP' was not declared in this scope; did you mean 'WSAEOPNOTSUPP'?
  2562.   124 |       operation_not_supported =   EOPNOTSUPP,
  2563.       |                                   ^~~~~~~~~~
  2564.       |                                   WSAEOPNOTSUPP
  2565. c:usersavkolgccincludec++10.2.0x86_64-w64-mingw32bitserror_constants.h:126:34: error: 'EWOULDBLOCK' was not declared in this scope; did you mean 'WSAEWOULDBLOCK'?
  2566.   126 |       operation_would_block =    EWOULDBLOCK,
  2567.       |                                  ^~~~~~~~~~~
  2568.       |                                  WSAEWOULDBLOCK
  2569. c:usersavkolgccincludec++10.2.0x86_64-w64-mingw32bitserror_constants.h:129:24: error: 'EOWNERDEAD' was not declared in this scope
  2570.   129 |       owner_dead =     EOWNERDEAD,
  2571.       |                        ^~~~~~~~~~
  2572. c:usersavkolgccincludec++10.2.0x86_64-w64-mingw32bitserror_constants.h:132:28: error: 'EPROTO' was not declared in this scope
  2573.   132 |       protocol_error =     EPROTO,
  2574.       |                            ^~~~~~
  2575. c:usersavkolgccincludec++10.2.0x86_64-w64-mingw32bitserror_constants.h:133:35: error: 'EPROTONOSUPPORT' was not declared in this scope; did you mean 'WSAEPROTONOSUPPORT'?
  2576.   133 |       protocol_not_supported =    EPROTONOSUPPORT,
  2577.       |                                   ^~~~~~~~~~~~~~~
  2578.       |                                   WSAEPROTONOSUPPORT
  2579. c:usersavkolgccincludec++10.2.0x86_64-w64-mingw32bitserror_constants.h:148:23: error: 'ETIMEDOUT' was not declared in this scope; did you mean 'WSAETIMEDOUT'?
  2580.   148 |       timed_out =     ETIMEDOUT,
  2581.       |                       ^~~~~~~~~
  2582.       |                       WSAETIMEDOUT
  2583. c:usersavkolgccincludec++10.2.0x86_64-w64-mingw32bitserror_constants.h:153:41: error: 'ELOOP' was not declared in this scope; did you mean 'CE_OOP'?
  2584.   153 |       too_many_symbolic_link_levels =   ELOOP,
  2585.       |                                         ^~~~~
  2586.       |                                         CE_OOP
  2587. c:usersavkolgccincludec++10.2.0x86_64-w64-mingw32bitserror_constants.h:155:28: error: 'EOVERFLOW' was not declared in this scope
  2588.   155 |       value_too_large =    EOVERFLOW,
  2589.       |                            ^~~~~~~~~
  2590. c:usersavkolgccincludec++10.2.0x86_64-w64-mingw32bitserror_constants.h:157:32: error: 'EPROTOTYPE' was not declared in this scope; did you mean 'WSAEPROTOTYPE'?
  2591.   157 |       wrong_protocol_type =    EPROTOTYPE
  2592.       |                                ^~~~~~~~~~
  2593.       |                                WSAEPROTOTYPE
  2594. In file included from test.cpp:2:
  2595. C:/MinGW/include/GL/glew.h:1655:9: error: 'ptrdiff_t' does not name a type
  2596.  1655 | typedef ptrdiff_t GLintptr;
  2597.       |         ^~~~~~~~~
  2598. In file included from test.cpp:2:
  2599. C:/MinGW/include/GL/glew.h:1181:1: note: 'ptrdiff_t' is defined in header '<cstddef>'; did you forget to '#include <cstddef>'?
  2600.  1180 | #    include <GL/glu.h>
  2601.   +++ |+#include <cstddef>
  2602.  1181 | #  endif
  2603. In file included from test.cpp:2:
  2604. C:/MinGW/include/GL/glew.h:1656:9: error: 'ptrdiff_t' does not name a type
  2605.  1656 | typedef ptrdiff_t GLsizeiptr;
  2606.       |         ^~~~~~~~~
  2607. C:/MinGW/include/GL/glew.h:1656:9: note: 'ptrdiff_t' is defined in header '<cstddef>'; did you forget to '#include <cstddef>'?
  2608. C:/MinGW/include/GL/glew.h:1660:65: error: 'GLsizeiptr' has not been declared
  2609.  1660 | typedef void (GLAPIENTRY * PFNGLBUFFERDATAPROC) (GLenum target, GLsizeiptr size, const GLvoid* data, GLenum usage);
  2610.       |                                                                 ^~~~~~~~~~
  2611. C:/MinGW/include/GL/glew.h:1661:68: error: 'GLintptr' has not been declared
  2612.  1661 | typedef void (GLAPIENTRY * PFNGLBUFFERSUBDATAPROC) (GLenum target, GLintptr offset, GLsizeiptr size, const GLvoid* data);
  2613.       |                                                                    ^~~~~~~~
  2614. C:/MinGW/include/GL/glew.h:1661:85: error: 'GLsizeiptr' has not been declared
  2615.  1661 | typedef void (GLAPIENTRY * PFNGLBUFFERSUBDATAPROC) (GLenum target, GLintptr offset, GLsizeiptr size, const GLvoid* data);
  2616.       |                                                                                     ^~~~~~~~~~
  2617. C:/MinGW/include/GL/glew.h:1669:71: error: 'GLintptr' has not been declared
  2618.  1669 | typedef void (GLAPIENTRY * PFNGLGETBUFFERSUBDATAPROC) (GLenum target, GLintptr offset, GLsizeiptr size, GLvoid* data);